program: Orca
programVersion: 5.0.2
elementType: Cl Cl O O O N C C C C C C C C C C C C C C C C C C C C C C H H H H H H H H H H H H H H H H H H H
charge: 0
multiplicity: 1
keywords: wb97x-d3
keywords: def2-TZVPP
keywords: def2/J RIJCOSX
keywords: DEFGRID2
keywords: scfconv7
keywords: smallprint printgap noloewdin
keywords: NOSOSCF
formula: C22H19Cl2NO3
InChI: InChI=1/C22H19Cl2NO3/c1-22(2)17(12-19(23)24)20(22)21(26)28-18(13-25)14-7-6-10-16(11-14)27-15-8-4-3-5-9-15/h3-12,17-18,20H,1-2H3
47 atoms
Cl -0.675913 -4.369366 -1.321656
Cl -1.847808 -6.666048 -0.019585
O  1.081935 -0.956348 0.122682
O  -0.959746 -0.233978 -0.439694
O  0.674298 4.695908 0.61992
N  3.866078 -0.968162 -1.651636
C  -1.835451 -1.895784 2.079979
C  -2.072274 -2.687472 0.842037
C  -0.707117 -2.075054 1.070633
C  -2.52625 -0.564462 2.239526
C  -1.636661 -2.627175 3.385273
C  -2.213982 -4.160016 0.8632
C  -0.260631 -0.993559 0.180692
C  -1.655093 -4.956997 -0.036016
C  1.673719 0.06378 -0.676168
C  1.956405 1.295968 0.147446
C  2.903665 -0.52253 -1.211227
C  1.187235 2.433153 -0.058613
C  2.935431 1.269779 1.134428
C  1.417707 3.55987 0.722466
C  3.148172 2.398652 1.908643
C  2.399168 3.546634 1.704055
C  0.140443 5.086053 -0.579566
C  0.886191 5.093459 -1.751631
C  -1.16756 5.546271 -0.568023
C  0.302432 5.559759 -2.920644
C  -1.733436 6.02261 -1.741967
C  -1.005107 6.02626 -2.922975
H  -2.666212 -2.190558 0.078549
H  0.077857 -2.752732 1.385577
H  -2.774773 -0.090626 1.292733
H  -1.909196 0.128875 2.813689
H  -3.459742 -0.703978 2.787764
H  -2.599145 -2.852716 3.848658
H  -1.070133 -2.010718 4.08526
H  -1.096194 -3.566554 3.263497
H  -2.825724 -4.613651 1.634879
H  1.038375 0.315453 -1.530156
H  0.415591 2.430983 -0.818604
H  3.534351 0.382266 1.298447
H  3.911888 2.391485 2.675071
H  2.570253 4.430669 2.305343
H  1.911993 4.746969 -1.759181
H  -1.733938 5.536995 0.354574
H  0.881681 5.56493 -3.834667
H  -2.752708 6.385712 -1.730001
H  -1.451327 6.392685 -3.838054
elementType: Cl O N C H
totalener: -2050.68450091 hartree
nucrepener: 2737.95918049 hartree
electener: -4788.64368140 hartree
oneelecener: -8251.61970221 hartree
twoeener: 3462.97602081 hartree
cpcmener: -0.02909436 hartree
kineticenergy: 2044.48634091 hartree
xcener: -151.864739182692 hartree
chargesum: 0.0000000
charge: -0.049509 -0.054752 -0.275397 -0.449987 -0.325082 -0.088665 0.131495 -0.029793 -0.150275 -0.273968 -0.279130 -0.218959 0.414795 0.077254 0.403622 -0.005514 -0.223389 -0.162491 -0.217902 0.274274 -0.125449 -0.231069 0.282962 -0.195481 -0.246088 -0.139385 -0.120465 -0.183342 0.113279 0.114179 0.095977 0.101618 0.096663 0.102358 0.100112 0.094109 0.140597 0.131409 0.141788 0.144705 0.159325 0.147912 0.156794 0.146062 0.159380 0.157737 0.157686
qa: -0.0495 -0.0548 -0.2754 -0.4500 -0.3251 -0.0887 0.1315 -0.0298 -0.1503 -0.2740 -0.2791 -0.2190 0.4148 0.0773 0.4036 -0.0055 -0.2234 -0.1625 -0.2179 0.2743 -0.1254 -0.2311 0.2830 -0.1955 -0.2461 -0.1394 -0.1205 -0.1833 0.1133 0.1142 0.0960 0.1016 0.0967 0.1024 0.1001 0.0941 0.1406 0.1314 0.1418 0.1447 0.1593 0.1479 0.1568 0.1461 0.1594 0.1577 0.1577
va: 1.2818 1.2514 2.1265 2.0588 2.0848 3.1110 3.7154 3.8705 3.8519 3.8925 3.9154 3.9068 4.1366 4.1846 3.7375 3.6622 4.0698 3.9046 3.9968 3.7470 3.9166 4.0194 3.6908 3.9219 4.0136 3.8881 3.8826 3.9076 1.0224 1.0237 1.0175 0.9986 1.0015 0.9995 1.0028 0.9990 1.0083 1.0230 1.0180 1.0080 0.9898 1.0060 0.9967 1.0080 0.9901 0.9893 0.9906
dispcorr: -0.023950558 hartree
energy: -2050.708451471270
dipole: -5.70364 4.26753 -1.43611 33.52630 -32.69458 0.83172 15.42955 -13.81870 1.61085
magnitude: 2.31279 au
magnitude: 5.87865 debye
