program: Orca
programVersion: 5.0.2
elementType: Cl Cl O O O N C C C C C C C C C C C C C C C C C C C C C C H H H H H H H H H H H H H H H H H H H
charge: 0
multiplicity: 1
keywords: wb97x-d3
keywords: def2-TZVPP
keywords: def2/J RIJCOSX
keywords: DEFGRID2
keywords: scfconv7
keywords: smallprint printgap noloewdin
keywords: NOSOSCF
formula: C22H19Cl2NO3
InChI: InChI=1/C22H19Cl2NO3/c1-22(2)17(12-19(23)24)20(22)21(26)28-18(13-25)14-7-6-10-16(11-14)27-15-8-4-3-5-9-15/h3-12,17-18,20H,1-2H3
47 atoms
Cl -2.335368 -1.480865 1.680568
Cl -4.886683 -2.513127 0.804032
O  1.341927 -0.944978 -0.311133
O  1.519712 -2.732445 1.010006
O  1.310776 4.002099 -1.632012
N  1.848777 0.251906 2.819297
C  -0.324565 -3.99286 -1.262382
C  -1.078541 -3.715664 -0.0089
C  -0.239606 -2.614828 -0.615251
C  0.850383 -4.935612 -1.209733
C  -1.072776 -4.035506 -2.572259
C  -2.550637 -3.575368 0.022216
C  0.94743 -2.154929 0.120574
C  -3.173513 -2.647642 0.734969
C  2.453348 -0.355169 0.34526
C  2.823794 0.909889 -0.386957
C  2.103063 -0.039074 1.737342
C  1.850139 1.86777 -0.648182
C  4.13983 1.110946 -0.775121
C  2.213142 3.037924 -1.298563
C  4.484928 2.284338 -1.432054
C  3.529827 3.251074 -1.691861
C  0.252102 4.284528 -0.809708
C  -0.975288 4.510605 -1.415146
C  0.400355 4.410002 0.566195
C  -2.06489 4.869322 -0.633974
C  -0.700905 4.75675 1.335418
C  -1.935304 4.987731 0.74252
H  -0.655433 -4.156772 0.890824
H  -0.769781 -1.832611 -1.146434
H  0.515173 -5.950588 -1.431727
H  1.337122 -4.961024 -0.236851
H  1.599497 -4.665887 -1.956678
H  -1.487203 -5.031139 -2.743256
H  -0.40197 -3.810603 -3.40317
H  -1.895711 -3.320574 -2.610971
H  -3.155415 -4.281201 -0.535895
H  3.308153 -1.037818 0.365496
H  0.822144 1.701847 -0.347432
H  4.890675 0.359343 -0.567955
H  5.509324 2.449568 -1.738217
H  3.797035 4.168993 -2.2001
H  -1.073584 4.413761 -2.489126
H  1.360796 4.246549 1.039363
H  -3.021098 5.050309 -1.107863
H  -0.586341 4.853762 2.407331
H  -2.788139 5.262205 1.349165
elementType: Cl O N C H
totalener: -2050.68535142 hartree
nucrepener: 2780.57884798 hartree
electener: -4831.26419940 hartree
oneelecener: -8337.34781378 hartree
twoeener: 3506.08361438 hartree
cpcmener: -0.03220608 hartree
kineticenergy: 2044.47668002 hartree
xcener: -151.863226059783 hartree
chargesum: 0.0000000
charge: -0.049718 -0.055338 -0.280612 -0.439894 -0.326904 -0.090192 0.130263 -0.032154 -0.131577 -0.267474 -0.279930 -0.219591 0.393834 0.078916 0.435649 0.003445 -0.236792 -0.186356 -0.187291 0.226517 -0.123001 -0.220789 0.281800 -0.246637 -0.191841 -0.121163 -0.140804 -0.183888 0.111833 0.116395 0.097107 0.094433 0.100507 0.102253 0.100676 0.094283 0.139829 0.128341 0.146018 0.145713 0.158505 0.148860 0.145888 0.155789 0.157622 0.159442 0.158029
qa: -0.0497 -0.0553 -0.2806 -0.4399 -0.3269 -0.0902 0.1303 -0.0322 -0.1316 -0.2675 -0.2799 -0.2196 0.3938 0.0789 0.4356 0.0034 -0.2368 -0.1864 -0.1873 0.2265 -0.1230 -0.2208 0.2818 -0.2466 -0.1918 -0.1212 -0.1408 -0.1839 0.1118 0.1164 0.0971 0.0944 0.1005 0.1023 0.1007 0.0943 0.1398 0.1283 0.1460 0.1457 0.1585 0.1489 0.1459 0.1558 0.1576 0.1594 0.1580
va: 1.2833 1.2506 2.1587 2.0643 2.0818 3.1111 3.7247 3.8711 3.8415 3.8939 3.9151 3.9082 4.1570 4.1836 3.7229 3.7299 4.0172 3.9437 3.9432 3.7921 3.9149 4.0002 3.6915 4.0106 3.9143 3.8830 3.8913 3.9062 1.0249 1.0190 1.0015 1.0159 0.9993 0.9995 1.0027 0.9992 1.0089 1.0229 1.0177 1.0030 0.9901 1.0048 1.0079 0.9975 0.9892 0.9901 0.9906
dispcorr: -0.023959005 hartree
energy: -2050.709310425611
dipole: 17.08278 -16.71626 0.36652 -1.03448 0.28899 -0.74548 -18.27100 15.64007 -2.63093
magnitude: 2.75896 au
magnitude: 7.01273 debye
