program: Orca
programVersion: 5.0.2
elementType: Cl Cl O O O N C C C C C C C C C C C C C C C C C C C C C C H H H H H H H H H H H H H H H H H H H
charge: 0
multiplicity: 1
keywords: wb97x-d3
keywords: def2-TZVPP
keywords: def2/J RIJCOSX
keywords: DEFGRID2
keywords: scfconv7
keywords: smallprint printgap noloewdin
keywords: NOSOSCF
formula: C22H19Cl2NO3
InChI: InChI=1/C22H19Cl2NO3/c1-22(2)17(12-19(23)24)20(22)21(26)28-18(13-25)14-7-6-10-16(11-14)27-15-8-4-3-5-9-15/h3-12,17-18,20H,1-2H3
47 atoms
Cl -1.685714 -4.819886 -0.85912
Cl -3.340083 -5.397518 1.432686
O  1.190557 -0.73165 -0.023884
O  1.364231 -0.212713 2.134677
O  1.240221 4.335672 -0.407884
N  4.113495 -1.924604 1.233487
C  -1.854322 -0.510356 0.386036
C  -1.416991 -1.94529 0.420792
C  -0.741488 -0.927069 1.328704
C  -1.582834 0.2854 -0.867374
C  -3.145886 -0.10166 1.054605
C  -2.22228 -2.995139 1.056652
C  0.68439 -0.579466 1.211349
C  -2.385807 -4.2300 0.598785
C  2.552557 -0.410175 -0.221366
C  2.874877 1.068785 -0.100222
C  3.410138 -1.243944 0.632239
C  1.869488 2.005859 -0.300946
C  4.182696 1.481398 0.117654
C  2.179849 3.359477 -0.273325
C  4.475936 2.837522 0.14031
C  3.484869 3.782831 -0.056221
C  0.057911 4.0908 -1.057029
C  0.029974 3.57452 -2.346626
C  -1.114871 4.444042 -0.406792
C  -1.191613 3.408326 -2.981988
C  -2.329699 4.285689 -1.059973
C  -2.37399 3.763197 -2.344633
H  -0.835237 -2.259025 -0.437793
H  -1.03793 -0.966597 2.370824
H  -0.733976 -0.076705 -1.441919
H  -1.41617 1.336858 -0.625466
H  -2.457283 0.236695 -1.519142
H  -3.309764 -0.589778 2.014575
H  -3.996864 -0.332643 0.411289
H  -3.148709 0.974979 1.233694
H  -2.71799 -2.754076 1.98963
H  2.754299 -0.72433 -1.249997
H  0.849213 1.692343 -0.47478
H  4.978484 0.763367 0.270272
H  5.49401 3.161229 0.311779
H  3.715439 4.840481 -0.035898
H  0.949028 3.310434 -2.855268
H  -1.075159 4.849069 0.596696
H  -1.215814 3.007201 -3.986984
H  -3.244544 4.568427 -0.55526
H  -3.322965 3.636704 -2.848839
elementType: Cl O N C H
totalener: -2050.68191762 hartree
nucrepener: 2824.55150643 hartree
electener: -4875.23342405 hartree
oneelecener: -8423.98341518 hartree
twoeener: 3548.74999113 hartree
cpcmener: -0.03536845 hartree
kineticenergy: 2044.45470975 hartree
xcener: -151.867607766930 hartree
chargesum: -0.0000000
charge: -0.055147 -0.058766 -0.284954 -0.420998 -0.323695 -0.082262 0.120285 0.052147 -0.092599 -0.290394 -0.275597 -0.220348 0.398101 0.043429 0.432690 -0.040506 -0.235438 -0.181447 -0.215763 0.283269 -0.107865 -0.245493 0.271093 -0.190828 -0.211914 -0.142810 -0.130832 -0.180177 0.088861 0.094692 0.106069 0.061082 0.115613 0.093314 0.101945 0.098159 0.129201 0.146611 0.136716 0.135348 0.158563 0.146192 0.155874 0.145564 0.157788 0.157886 0.157341
qa: -0.0551 -0.0588 -0.2850 -0.4210 -0.3237 -0.0823 0.1203 0.0521 -0.0926 -0.2904 -0.2756 -0.2203 0.3981 0.0434 0.4327 -0.0405 -0.2354 -0.1814 -0.2158 0.2833 -0.1079 -0.2455 0.2711 -0.1908 -0.2119 -0.1428 -0.1308 -0.1802 0.0889 0.0947 0.1061 0.0611 0.1156 0.0933 0.1019 0.0982 0.1292 0.1466 0.1367 0.1353 0.1586 0.1462 0.1559 0.1456 0.1578 0.1579 0.1573
va: 1.2707 1.2462 2.1302 2.0807 2.0938 3.1037 3.6856 3.8574 3.8879 3.8903 3.9178 3.8961 4.1916 4.2158 3.8252 3.8140 4.1036 3.9260 3.9640 3.7480 3.9230 4.0037 3.6925 3.9087 3.9722 3.8490 3.8626 3.8653 1.0415 1.0319 1.0134 1.0099 1.0009 1.0067 1.0005 1.0011 1.0200 0.9894 0.9851 1.0135 0.9895 1.0078 0.9964 1.0070 0.9912 0.9897 0.9914
dispcorr: -0.027314650 hartree
energy: -2050.709232274639
dipole: -2.18569 0.30680 -1.87889 37.06494 -35.41433 1.65061 -7.04155 5.06100 -1.98054
magnitude: 3.19019 au
magnitude: 8.10881 debye
