program: Orca
programVersion: 5.0.2
elementType: Cl Cl O O O N C C C C C C C C C C C C C C C C C C C C C C H H H H H H H H H H H H H H H H H H H
charge: 0
multiplicity: 1
keywords: wb97x-d3
keywords: def2-TZVPP
keywords: def2/J RIJCOSX
keywords: DEFGRID2
keywords: scfconv7
keywords: smallprint printgap noloewdin
keywords: NOSOSCF
formula: C22H19Cl2NO3
InChI: InChI=1/C22H19Cl2NO3/c1-22(2)17(12-19(23)24)20(22)21(26)28-18(13-25)14-7-6-10-16(11-14)27-15-8-4-3-5-9-15/h3-12,17-18,20H,1-2H3
47 atoms
Cl 0.141104 -4.544429 2.248759
Cl -2.151469 -6.299926 2.321679
O  0.753705 -0.794042 1.097613
O  1.447939 -1.774985 -0.785684
O  -0.057383 3.959215 -0.491823
N  2.207914 0.670287 3.666177
C  -1.594836 -2.468768 -1.154608
C  -0.920277 -3.621208 -0.496797
C  -0.741706 -2.234861 0.084135
C  -1.121386 -2.033646 -2.517915
C  -3.07657 -2.272988 -0.943042
C  -1.669712 -4.637699 0.273599
C  0.587312 -1.607895 0.03977
C  -1.281626 -5.094594 1.455474
C  1.986445 -0.093076 1.176745
C  2.025843 1.109937 0.264028
C  2.097163 0.324235 2.576752
C  0.958612 1.997027 0.252574
C  3.132514 1.325397 -0.544273
C  1.007607 3.116226 -0.567279
C  3.171044 2.451661 -1.352445
C  2.11851 3.35364 -1.3706
C  -0.290796 4.8611 -1.500345
C  -0.273812 6.210736 -1.187784
C  -0.595164 4.427038 -2.783736
C  -0.577836 7.139735 -2.17414
C  -0.886061 5.36563 -3.762454
C  -0.879749 6.72209 -3.462335
H  -0.04857 -4.007077 -1.020436
H  -1.30476 -2.021279 0.98516
H  -1.228636 -0.955589 -2.646158
H  -1.73177 -2.517632 -3.282583
H  -0.085206 -2.297284 -2.716036
H  -3.648407 -2.869464 -1.656579
H  -3.347832 -1.227091 -1.095539
H  -3.399739 -2.552677 0.060116
H  -2.572608 -5.053559 -0.159675
H  2.833896 -0.752639 0.964692
H  0.089758 1.835906 0.880411
H  3.957521 0.624585 -0.540022
H  4.032715 2.634384 -1.980872
H  2.17567 4.230246 -2.00267
H  -0.03416 6.530443 -0.181358
H  -0.611795 3.369046 -3.015768
H  -0.571879 8.194532 -1.931632
H  -1.125431 5.032339 -4.76401
H  -1.113002 7.449074 -4.22912
elementType: Cl O N C H
totalener: -2050.68442267 hartree
nucrepener: 2723.37585479 hartree
electener: -4774.06027746 hartree
oneelecener: -8222.49034289 hartree
twoeener: 3448.43006543 hartree
cpcmener: -0.03061550 hartree
kineticenergy: 2044.48833551 hartree
xcener: -151.864841867699 hartree
chargesum: 0.0000000
charge: -0.048937 -0.054723 -0.282647 -0.442108 -0.322743 -0.087431 0.134008 -0.024926 -0.142178 -0.274849 -0.279766 -0.222090 0.389937 0.080152 0.415606 0.013044 -0.228980 -0.238019 -0.197228 0.256360 -0.142503 -0.179205 0.231804 -0.206375 -0.173243 -0.139902 -0.151577 -0.160816 0.114562 0.115968 0.102116 0.096560 0.095476 0.101309 0.100608 0.093703 0.139149 0.140505 0.134550 0.145900 0.160089 0.154179 0.146959 0.161560 0.158242 0.159208 0.158695
qa: -0.0489 -0.0547 -0.2826 -0.4421 -0.3227 -0.0874 0.1340 -0.0249 -0.1422 -0.2748 -0.2798 -0.2221 0.3899 0.0802 0.4156 0.0130 -0.2290 -0.2380 -0.1972 0.2564 -0.1425 -0.1792 0.2318 -0.2064 -0.1732 -0.1399 -0.1516 -0.1608 0.1146 0.1160 0.1021 0.0966 0.0955 0.1013 0.1006 0.0937 0.1391 0.1405 0.1345 0.1459 0.1601 0.1542 0.1470 0.1616 0.1582 0.1592 0.1587
va: 1.2829 1.2511 2.1151 2.0710 2.0790 3.1133 3.7124 3.8726 3.8493 3.8916 3.9183 3.9136 4.1428 4.1814 3.7199 3.6438 4.0804 4.0514 3.9737 3.7911 3.9259 3.8928 3.7285 3.9976 3.9312 3.8886 3.8912 3.8882 1.0203 1.0231 0.9991 1.0013 1.0182 0.9999 1.0028 0.9990 1.0090 1.0176 1.0289 1.0031 0.9911 0.9993 1.0054 0.9946 0.9896 0.9903 0.9900
dispcorr: -0.024035314 hartree
energy: -2050.708457985817
dipole: -5.40072 4.43463 -0.96610 30.89036 -30.48959 0.40077 -31.58159 28.77252 -2.80907
magnitude: 2.99747 au
magnitude: 7.61897 debye
