program: Orca
programVersion: 5.0.2
elementType: Cl Cl O O O N C C C C C C C C C C C C C C C C C C C C C C H H H H H H H H H H H H H H H H H H H
charge: 0
multiplicity: 1
keywords: wb97x-d3
keywords: def2-TZVPP
keywords: def2/J RIJCOSX
keywords: DEFGRID2
keywords: scfconv7
keywords: smallprint printgap noloewdin
keywords: NOSOSCF
formula: C22H19Cl2NO3
InChI: InChI=1/C22H19Cl2NO3/c1-22(2)17(12-19(23)24)20(22)21(26)28-18(13-25)14-7-6-10-16(11-14)27-15-8-4-3-5-9-15/h3-12,17-18,20H,1-2H3
47 atoms
Cl 0.479322 -4.193913 2.800401
Cl -1.574245 -5.968612 3.79674
O  0.136993 -0.765215 0.072388
O  1.156068 -2.539298 -0.820619
O  1.420593 4.532833 -1.925701
N  3.205993 -0.614466 1.449327
C  -1.874187 -3.567528 -0.840954
C  -1.00542 -4.289924 0.128847
C  -1.021632 -2.779316 0.146871
C  -1.509847 -3.595866 -2.303846
C  -3.36085 -3.513379 -0.588348
C  -1.552832 -5.040879 1.279267
C  0.197433 -2.065675 -0.264565
C  -0.962982 -5.067449 2.46576
C  1.284944 0.021462 -0.211852
C  0.932937 1.478497 -0.050119
C  2.361994 -0.349069 0.716553
C  1.277518 2.360261 -1.063121
C  0.293951 1.93708 1.09683
C  0.995792 3.713103 -0.923458
C  0.009365 3.288018 1.216165
C  0.359941 4.185223 0.2169
C  0.671347 5.622263 -2.287012
C  1.341721 6.819083 -2.490383
C  -0.697225 5.525568 -2.50748
C  0.63235 7.931707 -2.921743
C  -1.394992 6.648613 -2.927382
C  -0.736592 7.853761 -3.135772
H  -0.099351 -4.720395 -0.291077
H  -1.577327 -2.300117 0.945233
H  -1.839476 -2.683413 -2.804337
H  -2.008126 -4.436151 -2.790499
H  -0.441232 -3.709381 -2.476903
H  -3.802948 -2.64767 -1.08468
H  -3.606159 -3.444447 0.472309
H  -3.848211 -4.405888 -0.985627
H  -2.45624 -5.62502 1.144985
H  1.647738 -0.160909 -1.22751
H  1.769095 2.004703 -1.961133
H  0.025607 1.255834 1.8942
H  -0.483198 3.656211 2.106486
H  0.144132 5.239351 0.337685
H  2.409294 6.87715 -2.318346
H  -1.21655 4.586128 -2.361295
H  1.155688 8.865376 -3.083737
H  -2.460999 6.574918 -3.100308
H  -1.286882 8.724543 -3.467344
elementType: Cl O N C H
totalener: -2050.68518806 hartree
nucrepener: 2661.02661916 hartree
electener: -4711.71180722 hartree
oneelecener: -8097.81366815 hartree
twoeener: 3386.10186093 hartree
cpcmener: -0.03239218 hartree
kineticenergy: 2044.46784561 hartree
xcener: -151.860747512216 hartree
chargesum: -0.0000000
charge: -0.049395 -0.055268 -0.280046 -0.439297 -0.327149 -0.088379 0.131673 -0.040671 -0.124934 -0.265761 -0.280842 -0.210604 0.393443 0.070155 0.420603 0.005710 -0.234557 -0.202181 -0.206998 0.225359 -0.154809 -0.150184 0.256810 -0.234005 -0.172498 -0.128056 -0.150072 -0.176094 0.112306 0.113284 0.101481 0.097492 0.093816 0.099425 0.094399 0.102715 0.140417 0.126920 0.137278 0.150053 0.160081 0.158615 0.146478 0.157546 0.157872 0.159267 0.158604
qa: -0.0494 -0.0553 -0.2800 -0.4393 -0.3271 -0.0884 0.1317 -0.0407 -0.1249 -0.2658 -0.2808 -0.2106 0.3934 0.0702 0.4206 0.0057 -0.2346 -0.2022 -0.2070 0.2254 -0.1548 -0.1502 0.2568 -0.2340 -0.1725 -0.1281 -0.1501 -0.1761 0.1123 0.1133 0.1015 0.0975 0.0938 0.0994 0.0944 0.1027 0.1404 0.1269 0.1373 0.1501 0.1601 0.1586 0.1465 0.1575 0.1579 0.1593 0.1586
va: 1.2836 1.2511 2.1574 2.0657 2.0715 3.1115 3.7277 3.8750 3.8323 3.8917 3.9141 3.8987 4.1697 4.1906 3.7091 3.7439 4.0218 4.0419 3.9771 3.8113 3.9292 3.8989 3.7070 4.0023 3.9070 3.8892 3.8950 3.8975 1.0258 1.0201 0.9994 1.0015 1.0152 1.0033 0.9989 0.9993 1.0079 1.0273 1.0167 1.0110 0.9914 0.9948 1.0072 0.9960 0.9893 0.9904 0.9902
dispcorr: -0.023197265 hartree
energy: -2050.708385319961
dipole: -14.83495 11.71752 -3.11743 26.81955 -25.55313 1.26641 -28.89339 27.41958 -1.47381
magnitude: 3.67346 au
magnitude: 9.33719 debye
