program: Orca
programVersion: 5.0.2
elementType: Cl Cl O O O N C C C C C C C C C C C C C C C C C C C C C C H H H H H H H H H H H H H H H H H H H
charge: 0
multiplicity: 1
keywords: wb97x-d3
keywords: def2-TZVPP
keywords: def2/J RIJCOSX
keywords: DEFGRID2
keywords: scfconv7
keywords: smallprint printgap noloewdin
keywords: NOSOSCF
formula: C22H19Cl2NO3
InChI: InChI=1/C22H19Cl2NO3/c1-22(2)17(12-19(23)24)20(22)21(26)28-18(13-25)14-7-6-10-16(11-14)27-15-8-4-3-5-9-15/h3-12,17-18,20H,1-2H3
47 atoms
Cl -2.460923 0.166322 -2.357672
Cl -4.04656 -2.040432 -3.317456
O  1.601721 -1.328147 -0.076903
O  2.243632 -3.448018 0.17612
O  1.131618 3.640952 0.909818
N  3.596011 -1.346493 2.658108
C  -1.081129 -2.602791 0.9183
C  -1.144159 -1.983072 -0.451767
C  -0.061868 -2.993816 -0.134457
C  -0.690167 -1.708815 2.070592
C  -2.069383 -3.671853 1.316608
C  -2.191326 -2.350719 -1.41204
C  1.365465 -2.64327 -0.000977
C  -2.806286 -1.517972 -2.242285
C  2.9236 -0.871747 0.172318
C  2.93707 0.613413 -0.086037
C  3.293494 -1.160041 1.565234
C  2.029059 1.425459 0.584661
C  3.825539 1.148927 -1.004878
C  1.993155 2.781598 0.299291
C  3.80074 2.515574 -1.254156
C  2.883689 3.332406 -0.617186
C  -0.068377 3.18298 1.392365
C  -0.932594 2.437397 0.599539
C  -0.417671 3.536615 2.686181
C  -2.150296 2.030881 1.124225
C  -1.647109 3.136866 3.193041
C  -2.512634 2.377202 2.419717
H  -0.821879 -0.949458 -0.490113
H  -0.19392 -3.991751 -0.538064
H  -0.071163 -0.86343 1.77618
H  -0.151562 -2.273782 2.834058
H  -1.588816 -1.300496 2.536856
H  -3.017417 -3.223305 1.619425
H  -1.684994 -4.237046 2.16745
H  -2.275712 -4.38818 0.522259
H  -2.500467 -3.388432 -1.452674
H  3.645573 -1.3755 -0.477429
H  1.355313 0.999273 1.318526
H  4.527226 0.509848 -1.525278
H  4.49125 2.945732 -1.967384
H  2.852744 4.394348 -0.825998
H  -0.661805 2.174479 -0.415673
H  0.264316 4.122998 3.28918
H  -2.823456 1.445801 0.510959
H  -1.922051 3.41642 4.201876
H  -3.466491 2.060758 2.820609
elementType: Cl O N C H
totalener: -2050.68463535 hartree
nucrepener: 2887.10678087 hartree
electener: -4937.79141623 hartree
oneelecener: -8548.91924289 hartree
twoeener: 3611.12782666 hartree
cpcmener: -0.03356152 hartree
kineticenergy: 2044.46270628 hartree
xcener: -151.863127530547 hartree
chargesum: -0.0000000
charge: -0.064034 -0.060407 -0.264050 -0.428967 -0.325219 -0.081933 0.114541 0.074553 -0.102758 -0.257517 -0.273712 -0.221307 0.397325 0.059876 0.374946 0.006253 -0.226442 -0.222698 -0.198218 0.253781 -0.110059 -0.231130 0.279988 -0.180371 -0.240272 -0.130683 -0.117513 -0.187151 0.061299 0.101353 0.053334 0.111545 0.100978 0.101774 0.099989 0.091982 0.127597 0.132469 0.176856 0.146972 0.158994 0.147114 0.148964 0.145520 0.140409 0.157927 0.158100
qa: -0.0640 -0.0604 -0.2640 -0.4290 -0.3252 -0.0819 0.1145 0.0746 -0.1028 -0.2575 -0.2737 -0.2213 0.3973 0.0599 0.3749 0.0063 -0.2264 -0.2227 -0.1982 0.2538 -0.1101 -0.2311 0.2800 -0.1804 -0.2403 -0.1307 -0.1175 -0.1872 0.0613 0.1014 0.0533 0.1115 0.1010 0.1018 0.1000 0.0920 0.1276 0.1325 0.1769 0.1470 0.1590 0.1471 0.1490 0.1455 0.1404 0.1579 0.1581
va: 1.2685 1.2449 2.1607 2.0756 2.0926 3.1056 3.7112 3.8403 3.8813 3.9251 3.9117 3.8876 4.2010 4.1821 3.7961 3.7084 4.0163 3.9306 3.9516 3.8043 3.9041 4.0096 3.7405 3.8792 4.0139 3.8252 3.8805 3.9400 1.0305 1.0276 1.0111 1.0062 1.0024 1.0003 1.0008 1.0058 1.0201 1.0188 0.9788 1.0015 0.9893 1.0062 0.9999 1.0075 1.0078 0.9884 0.9908
dispcorr: -0.028011968 hartree
energy: -2050.712647320430
dipole: 5.66806 -6.76858 -1.10052 -0.34298 0.70424 0.36126 22.49564 -23.36705 -0.87140
magnitude: 1.44948 au
magnitude: 3.68429 debye
