program: Orca
programVersion: 5.0.2
elementType: Cl Cl O O O N C C C C C C C C C C C C C C C C C C C C C C H H H H H H H H H H H H H H H H H H H
charge: 0
multiplicity: 1
keywords: wb97x-d3
keywords: def2-TZVPP
keywords: def2/J RIJCOSX
keywords: DEFGRID2
keywords: scfconv7
keywords: smallprint printgap noloewdin
keywords: NOSOSCF
formula: C22H19Cl2NO3
InChI: InChI=1/C22H19Cl2NO3/c1-22(2)17(12-19(23)24)20(22)21(26)28-18(13-25)14-7-6-10-16(11-14)27-15-8-4-3-5-9-15/h3-12,17-18,20H,1-2H3
47 atoms
Cl -4.480318 -2.797526 -0.212209
Cl -3.991059 -5.614946 0.174492
O  1.829377 -1.361328 -0.44496
O  -0.08014 -0.206908 -0.571184
O  2.016637 4.470619 0.047011
N  4.810739 -1.223012 -1.869184
C  -0.658061 -2.051713 1.943761
C  -1.510504 -2.434017 0.76613
C  -0.014235 -2.301717 0.591956
C  -0.79117 -0.647885 2.480845
C  -0.359147 -3.069259 3.017658
C  -2.117679 -3.766046 0.657974
C  0.52212 -1.179282 -0.19643
C  -3.359054 -4.014676 0.261376
C  2.504734 -0.282462 -1.080747
C  2.703713 0.882386 -0.139969
C  3.79284 -0.830197 -1.510834
C  2.255254 2.138527 -0.515317
C  3.308483 0.681621 1.095821
C  2.405289 3.203969 0.363975
C  3.46337 1.757258 1.955111
C  3.009076 3.018268 1.599079
C  0.878399 4.688323 -0.682431
C  -0.292921 3.974044 -0.460057
C  0.920928 5.706801 -1.623787
C  -1.424094 4.286265 -1.200412
C  -0.221848 6.015037 -2.347853
C  -1.395911 5.303476 -2.145179
H  -2.089752 -1.618752 0.34799
H  0.557686 -3.220277 0.520648
H  -1.112164 0.074333 1.733072
H  0.155184 -0.302191 2.901872
H  -1.531873 -0.634627 3.282413
H  -0.158641 -4.064543 2.62306
H  -1.196645 -3.146865 3.713513
H  0.518931 -2.764859 3.589906
H  -1.51098 -4.623536 0.923642
H  1.972545 0.041012 -1.981177
H  1.789633 2.27799 -1.483414
H  3.658775 -0.300365 1.389055
H  3.935091 1.61438 2.918273
H  3.122485 3.856424 2.275019
H  -0.332963 3.18377 0.279644
H  1.840877 6.255325 -1.783584
H  -2.33649 3.729814 -1.029151
H  -0.18718 6.811375 -3.080196
H  -2.283661 5.54196 -2.715881
elementType: Cl O N C H
totalener: -2050.68650116 hartree
nucrepener: 2737.77973884 hartree
electener: -4788.46624000 hartree
oneelecener: -8250.77475849 hartree
twoeener: 3462.30851849 hartree
cpcmener: -0.03121484 hartree
kineticenergy: 2044.47977967 hartree
xcener: -151.865048531474 hartree
chargesum: 0.0000000
charge: -0.055477 -0.059708 -0.274814 -0.436265 -0.327274 -0.086746 0.089345 0.031662 -0.069299 -0.261165 -0.264973 -0.208180 0.367783 0.041505 0.404053 0.025467 -0.225813 -0.186433 -0.239747 0.272053 -0.121987 -0.220133 0.282052 -0.188511 -0.246764 -0.147223 -0.121376 -0.183233 0.080974 0.100453 0.092221 0.096738 0.101488 0.091540 0.102253 0.098983 0.131194 0.138951 0.145075 0.146543 0.158742 0.148716 0.157668 0.145729 0.158478 0.157699 0.157756
qa: -0.0555 -0.0597 -0.2748 -0.4363 -0.3273 -0.0867 0.0893 0.0317 -0.0693 -0.2612 -0.2650 -0.2082 0.3678 0.0415 0.4041 0.0255 -0.2258 -0.1864 -0.2397 0.2721 -0.1220 -0.2201 0.2821 -0.1885 -0.2468 -0.1472 -0.1214 -0.1832 0.0810 0.1005 0.0922 0.0967 0.1015 0.0915 0.1023 0.0990 0.1312 0.1390 0.1451 0.1465 0.1587 0.1487 0.1577 0.1457 0.1585 0.1577 0.1578
va: 1.2702 1.2452 2.1336 2.0748 2.0841 3.1124 3.7427 3.8708 3.8295 3.9073 3.9034 3.8975 4.2320 4.2120 3.7324 3.5764 4.0741 3.9370 3.9703 3.7428 3.9048 4.0103 3.6947 3.9066 4.0085 3.9000 3.8836 3.9069 1.0481 1.0313 1.0151 1.0007 1.0015 1.0055 1.0008 1.0014 1.0176 1.0178 1.0077 1.0114 0.9894 1.0047 0.9950 1.0083 0.9908 0.9892 0.9905
dispcorr: -0.024400196 hartree
energy: -2050.710901353858
dipole: 16.12168 -16.70214 -0.58046 23.35984 -23.17253 0.18731 13.35766 -11.88384 1.47382
magnitude: 1.59504 au
magnitude: 4.05428 debye
