program: Orca
programVersion: 5.0.2
elementType: Cl Cl O O O N C C C C C C C C C C C C C C C C C C C C C C H H H H H H H H H H H H H H H H H H H
charge: 0
multiplicity: 1
keywords: wb97x-d3
keywords: def2-TZVPP
keywords: def2/J RIJCOSX
keywords: DEFGRID2
keywords: scfconv7
keywords: smallprint printgap noloewdin
keywords: NOSOSCF
formula: C22H19Cl2NO3
InChI: InChI=1/C22H19Cl2NO3/c1-22(2)17(12-19(23)24)20(22)21(26)28-18(13-25)14-7-6-10-16(11-14)27-15-8-4-3-5-9-15/h3-12,17-18,20H,1-2H3
47 atoms
Cl -2.274939 0.123815 0.657399
Cl -4.320878 -0.907252 -1.093933
O  2.079753 -2.066341 0.33418
O  2.24911 -2.237511 -1.883008
O  0.354679 2.63829 1.084686
N  4.151493 -1.302268 2.788405
C  -0.267851 -3.972953 0.261319
C  -0.790828 -2.5828 0.063306
C  0.321697 -3.118214 -0.839164
C  0.482192 -4.274649 1.53764
C  -1.079693 -5.155085 -0.216043
C  -2.095347 -2.289356 -0.53981
C  1.634298 -2.451563 -0.86936
C  -2.794029 -1.177542 -0.342861
C  3.206869 -1.200397 0.355122
C  2.810809 0.213362 0.003016
C  3.723611 -1.272877 1.723116
C  1.746493 0.80397 0.674521
C  3.476352 0.899295 -1.000697
C  1.360965 2.092367 0.345006
C  3.084753 2.194226 -1.314108
C  2.032818 2.799857 -0.647101
C  -0.632731 3.383764 0.503444
C  -1.20879 4.36701 1.296829
C  -1.101276 3.148206 -0.783559
C  -2.261847 5.118859 0.798209
C  -2.147813 3.917536 -1.272212
C  -2.732448 4.904124 -0.490138
H  -0.458599 -1.870687 0.809365
H  0.008189 -3.396598 -1.838829
H  1.283804 -4.993484 1.358868
H  -0.205871 -4.724145 2.256025
H  0.911831 -3.397093 2.012969
H  -1.873812 -5.385816 0.496228
H  -0.441176 -6.036356 -0.297037
H  -1.538045 -5.000165 -1.192152
H  -2.526185 -3.022666 -1.211023
H  3.998787 -1.555938 -0.311657
H  1.217788 0.277176 1.460594
H  4.295057 0.431862 -1.532444
H  3.605415 2.740672 -2.089149
H  1.745428 3.813473 -0.896397
H  -0.838925 4.533141 2.301082
H  -0.671007 2.371033 -1.40191
H  -2.710746 5.880753 1.422403
H  -2.511992 3.73354 -2.274818
H  -3.550522 5.495766 -0.879153
elementType: Cl O N C H
totalener: -2050.68269957 hartree
nucrepener: 2892.54976627 hartree
electener: -4943.23246585 hartree
oneelecener: -8560.61570542 hartree
twoeener: 3617.38323957 hartree
cpcmener: -0.03202699 hartree
kineticenergy: 2044.47389624 hartree
xcener: -151.865533533562 hartree
chargesum: -0.0000000
charge: -0.057468 -0.060317 -0.276070 -0.435368 -0.320663 -0.084859 0.103390 0.011939 -0.059842 -0.258251 -0.284015 -0.202310 0.377937 0.058370 0.388998 0.019809 -0.233892 -0.234268 -0.186740 0.246117 -0.121196 -0.185831 0.319822 -0.263191 -0.228619 -0.119364 -0.139860 -0.188920 0.087752 0.095715 0.101643 0.095275 0.090976 0.103667 0.100039 0.093493 0.127871 0.140196 0.140971 0.146474 0.160441 0.157739 0.145801 0.151905 0.157752 0.158996 0.157956
qa: -0.0575 -0.0603 -0.2761 -0.4354 -0.3207 -0.0849 0.1034 0.0119 -0.0598 -0.2583 -0.2840 -0.2023 0.3779 0.0584 0.3890 0.0198 -0.2339 -0.2343 -0.1867 0.2461 -0.1212 -0.1858 0.3198 -0.2632 -0.2286 -0.1194 -0.1399 -0.1889 0.0878 0.0957 0.1016 0.0953 0.0910 0.1037 0.1000 0.0935 0.1279 0.1402 0.1410 0.1465 0.1604 0.1577 0.1458 0.1519 0.1578 0.1590 0.1580
va: 1.2755 1.2450 2.1226 2.0758 2.0615 3.1071 3.7426 3.8772 3.8193 3.9003 3.9229 3.9125 4.2154 4.1980 3.7678 3.6292 4.0707 4.0353 3.9746 3.7932 3.8908 3.9340 3.5879 4.0202 3.8841 3.8877 3.9015 3.9122 1.0251 1.0281 1.0010 1.0002 1.0126 0.9993 1.0004 1.0053 1.0214 1.0157 1.0250 1.0033 0.9901 0.9948 1.0091 1.0045 0.9891 0.9897 0.9903
dispcorr: -0.027107902 hartree
energy: -2050.709807476569
dipole: 9.42053 -10.18914 -0.76862 -8.21969 7.69475 -0.52494 -1.29368 -0.03130 -1.32498
magnitude: 1.61923 au
magnitude: 4.11576 debye
