program: Orca
programVersion: 5.0.2
elementType: Cl Cl O O O N C C C C C C C C C C C C C C C C C C C C C C H H H H H H H H H H H H H H H H H H H
charge: 0
multiplicity: 1
keywords: wb97x-d3
keywords: def2-TZVPP
keywords: def2/J RIJCOSX
keywords: DEFGRID2
keywords: scfconv7
keywords: smallprint printgap noloewdin
keywords: NOSOSCF
formula: C22H19Cl2NO3
InChI: InChI=1/C22H19Cl2NO3/c1-22(2)17(12-19(23)24)20(22)21(26)28-18(13-25)14-7-6-10-16(11-14)27-15-8-4-3-5-9-15/h3-12,17-18,20H,1-2H3
47 atoms
Cl -2.354508 -4.907391 -1.779009
Cl -3.328183 -6.099139 0.659563
O  1.783307 -1.038839 1.213593
O  1.141033 -1.411563 -0.892968
O  0.875427 3.866647 0.610903
N  4.55427 -0.276811 2.822286
C  -1.663692 -1.156355 0.61936
C  -1.421734 -2.540992 0.085733
C  -0.358179 -1.868022 0.924525
C  -1.700055 -0.020413 -0.372941
C  -2.592323 -0.947022 1.79048
C  -2.108849 -3.71717 0.632033
C  0.897586 -1.437576 0.284731
C  -2.533533 -4.757893 -0.07347
C  3.001522 -0.493625 0.732077
C  2.823108 0.864345 0.090064
C  3.860489 -0.383659 1.913514
C  1.910279 1.766979 0.619898
C  3.578285 1.197601 -1.023961
C  1.758574 3.009513 0.023771
C  3.42896 2.452375 -1.597442
C  2.52353 3.365553 -1.081935
C  0.09907 4.69236 -0.157436
C  -0.506834 4.258314 -1.330637
C  -0.112573 5.979268 0.31627
C  -1.318894 5.134537 -2.036181
C  -0.936937 6.840168 -0.393955
C  -1.536235 6.42651 -1.575558
H  -1.202008 -2.578998 -0.975018
H  -0.250668 -2.202837 1.950503
H  -2.725803 0.134923 -0.711901
H  -1.090945 -0.197719 -1.257047
H  -1.363438 0.909724 0.089648
H  -3.631764 -0.934623 1.457272
H  -2.386541 0.013652 2.265643
H  -2.496511 -1.713754 2.558197
H  -2.282042 -3.753012 1.701219
H  3.49207 -1.178313 0.031693
H  1.311752 1.519933 1.488863
H  4.277905 0.484993 -1.442372
H  4.021372 2.723173 -2.46131
H  2.419921 4.341717 -1.538486
H  -0.355355 3.24952 -1.695164
H  0.360721 6.300253 1.235898
H  -1.788114 4.798401 -2.951913
H  -1.101968 7.843331 -0.022331
H  -2.171435 7.103552 -2.131355
elementType: Cl O N C H
totalener: -2050.68632178 hartree
nucrepener: 2727.66721724 hartree
electener: -4778.35353903 hartree
oneelecener: -8230.49743309 hartree
twoeener: 3452.14389407 hartree
cpcmener: -0.03204043 hartree
kineticenergy: 2044.46757447 hartree
xcener: -151.863193278760 hartree
chargesum: -0.0000000
charge: -0.055067 -0.060100 -0.279540 -0.427615 -0.328559 -0.086492 0.097197 0.026539 -0.067411 -0.268953 -0.266977 -0.204220 0.359419 0.042203 0.403897 0.029600 -0.229183 -0.252021 -0.197368 0.249083 -0.128244 -0.171881 0.286107 -0.187019 -0.246190 -0.154522 -0.122865 -0.180687 0.078376 0.101144 0.105190 0.096467 0.093244 0.102461 0.099253 0.092009 0.129464 0.145901 0.136923 0.144332 0.160459 0.158317 0.156192 0.146252 0.159227 0.157961 0.157696
qa: -0.0551 -0.0601 -0.2795 -0.4276 -0.3286 -0.0865 0.0972 0.0265 -0.0674 -0.2690 -0.2670 -0.2042 0.3594 0.0422 0.4039 0.0296 -0.2292 -0.2520 -0.1974 0.2491 -0.1282 -0.1719 0.2861 -0.1870 -0.2462 -0.1545 -0.1229 -0.1807 0.0784 0.1011 0.1052 0.0965 0.0932 0.1025 0.0993 0.0920 0.1295 0.1459 0.1369 0.1443 0.1605 0.1583 0.1562 0.1463 0.1592 0.1580 0.1577
va: 1.2706 1.2446 2.1209 2.0827 2.0680 3.1124 3.7495 3.8887 3.8132 3.9052 3.9042 3.9001 4.2417 4.2129 3.7190 3.6094 4.0784 4.0116 3.9934 3.7827 3.9016 3.9156 3.6785 3.8931 4.0126 3.9060 3.8884 3.9028 1.0500 1.0310 1.0018 1.0158 1.0004 1.0008 1.0018 1.0056 1.0191 1.0145 1.0267 1.0027 0.9902 0.9939 0.9970 1.0081 0.9906 0.9891 0.9905
dispcorr: -0.024596549 hartree
energy: -2050.710918333124
dipole: 1.12976 -2.28937 -1.15962 39.99781 -38.75093 1.24688 -0.47072 -0.35435 -0.82507
magnitude: 1.89213 au
magnitude: 4.80941 debye
