program: Orca
programVersion: 5.0.2
elementType: Cl Cl O O O N C C C C C C C C C C C C C C C C C C C C C C H H H H H H H H H H H H H H H H H H H
charge: 0
multiplicity: 1
keywords: wb97x-d3
keywords: def2-TZVPP
keywords: def2/J RIJCOSX
keywords: DEFGRID2
keywords: scfconv7
keywords: smallprint printgap noloewdin
keywords: NOSOSCF
formula: C22H19Cl2NO3
InChI: InChI=1/C22H19Cl2NO3/c1-22(2)17(12-19(23)24)20(22)21(26)28-18(13-25)14-7-6-10-16(11-14)27-15-8-4-3-5-9-15/h3-12,17-18,20H,1-2H3
47 atoms
Cl -4.498354 -3.277748 0.259509
Cl -3.688266 -6.029901 -0.051269
O  1.706788 -1.219637 -0.643046
O  -0.276215 -0.207629 -0.459034
O  1.877718 4.611057 0.430895
N  4.559459 -0.711221 -2.206748
C  -0.487326 -2.419992 1.81924
C  -1.423968 -2.715702 0.680186
C  0.031771 -2.430755 0.393089
C  -0.668745 -1.116326 2.556329
C  -0.007866 -3.540755 2.708667
C  -1.926521 -4.074453 0.433969
C  0.416841 -1.173342 -0.272186
C  -3.197316 -4.403927 0.241205
C  2.257918 -0.0237 -1.178824
C  2.456941 1.034743 -0.117118
C  3.54546 -0.425052 -1.750282
C  2.043198 2.33439 -0.370468
C  3.04652 0.69636 1.094585
C  2.21565 3.305239 0.609257
C  3.212002 1.676847 2.06059
C  2.795658 2.977731 1.828273
C  0.891951 4.972164 -0.450601
C  1.181078 5.990595 -1.345882
C  -0.372244 4.39734 -0.407366
C  0.188943 6.445751 -2.203282
C  -1.350428 4.853653 -1.278722
C  -1.076785 5.87771 -2.176556
H  -2.107036 -1.909116 0.438006
H  0.656646 -3.281186 0.143223
H  0.288389 -0.741404 2.924892
H  -1.314445 -1.275494 3.421852
H  -1.126568 -0.336494 1.951026
H  -0.75771 -3.773668 3.467066
H  0.905861 -3.244253 3.226841
H  0.211335 -4.457853 2.162912
H  -1.205371 -4.882914 0.40324
H  1.642009 0.365175 -1.99655
H  1.592182 2.577887 -1.324744
H  3.374017 -0.317084 1.289723
H  3.666486 1.426255 3.009995
H  2.921686 3.740501 2.586384
H  2.171278 6.42849 -1.363948
H  -0.597139 3.60654 0.297844
H  0.411909 7.245119 -2.898145
H  -2.336362 4.408026 -1.247317
H  -1.847384 6.232563 -2.848302
elementType: Cl O N C H
totalener: -2050.68645472 hartree
nucrepener: 2714.04736897 hartree
electener: -4764.73382368 hartree
oneelecener: -8203.34287349 hartree
twoeener: 3438.60904981 hartree
cpcmener: -0.03156902 hartree
kineticenergy: 2044.46380593 hartree
xcener: -151.861609571419 hartree
chargesum: 0.0000000
charge: -0.054603 -0.059776 -0.274459 -0.433898 -0.324390 -0.086937 0.093794 0.029329 -0.075580 -0.265037 -0.260295 -0.202073 0.362658 0.035647 0.401013 0.022628 -0.228125 -0.190405 -0.247779 0.287709 -0.117456 -0.226909 0.274537 -0.237465 -0.194334 -0.125331 -0.140337 -0.178411 0.082966 0.099798 0.095886 0.101782 0.096465 0.102133 0.099591 0.089712 0.131840 0.140470 0.142031 0.146192 0.158528 0.147885 0.146946 0.158313 0.157955 0.159397 0.158395
qa: -0.0546 -0.0598 -0.2745 -0.4339 -0.3244 -0.0869 0.0938 0.0293 -0.0756 -0.2650 -0.2603 -0.2021 0.3627 0.0356 0.4010 0.0226 -0.2281 -0.1904 -0.2478 0.2877 -0.1175 -0.2269 0.2745 -0.2375 -0.1943 -0.1253 -0.1403 -0.1784 0.0830 0.0998 0.0959 0.1018 0.0965 0.1021 0.0996 0.0897 0.1318 0.1405 0.1420 0.1462 0.1585 0.1479 0.1469 0.1583 0.1580 0.1594 0.1584
va: 1.2711 1.2452 2.1276 2.0778 2.0864 3.1123 3.7368 3.8757 3.8390 3.9041 3.9020 3.8813 4.2339 4.2107 3.7323 3.6072 4.0788 3.9474 3.9590 3.7358 3.9052 4.0013 3.6957 4.0145 3.9319 3.8815 3.8889 3.9027 1.0457 1.0329 1.0012 1.0014 1.0153 1.0014 1.0017 1.0050 1.0159 1.0184 1.0083 1.0127 0.9891 1.0057 1.0071 0.9974 0.9893 0.9901 0.9904
dispcorr: -0.024099210 hartree
energy: -2050.710553925910
dipole: 17.25885 -17.72634 -0.46749 23.98161 -23.85770 0.12391 11.98773 -10.74155 1.24618
magnitude: 1.33674 au
magnitude: 3.39772 debye
