program: Orca
programVersion: 5.0.2
elementType: Cl Cl O O O N C C C C C C C C C C C C C C C C C C C C C C H H H H H H H H H H H H H H H H H H H
charge: 0
multiplicity: 1
keywords: wb97x-d3
keywords: def2-TZVPP
keywords: def2/J RIJCOSX
keywords: DEFGRID2
keywords: scfconv7
keywords: smallprint printgap noloewdin
keywords: NOSOSCF
formula: C22H19Cl2NO3
InChI: InChI=1/C22H19Cl2NO3/c1-22(2)17(12-19(23)24)20(22)21(26)28-18(13-25)14-7-6-10-16(11-14)27-15-8-4-3-5-9-15/h3-12,17-18,20H,1-2H3
47 atoms
Cl -3.984307 -0.831419 -0.872127
Cl -3.893372 -2.16163 -3.429481
O  2.371209 -1.671262 0.075979
O  0.700907 -0.71641 1.209392
O  1.563715 3.878578 0.304593
N  3.353145 -0.624676 3.194343
C  -0.681815 -3.457775 0.447306
C  -1.257931 -2.30261 -0.320429
C  0.242111 -2.515062 -0.300979
C  -0.762926 -3.41409 1.952996
C  -0.790341 -4.856463 -0.109566
C  -1.976491 -2.486937 -1.587213
C  1.07927 -1.535622 0.412542
C  -3.125383 -1.905731 -1.908874
C  3.311151 -0.727304 0.582605
C  3.174048 0.620348 -0.08521
C  3.285824 -0.662073 2.048055
C  2.455585 1.658593 0.48995
C  3.751184 0.780993 -1.341412
C  2.278741 2.839769 -0.218439
C  3.596577 1.978532 -2.020743
C  2.8500 3.009856 -1.470392
C  0.385032 3.605238 0.950677
C  0.112325 4.315112 2.110233
C  -0.52901 2.685509 0.448704
C  -1.088517 4.102287 2.772939
C  -1.719478 2.474963 1.128217
C  -2.005705 3.179428 2.290328
H  -1.604063 -1.482081 0.298234
H  0.691955 -2.929238 -1.196362
H  -0.81004 -2.404495 2.355544
H  0.094849 -3.918843 2.401762
H  -1.661691 -3.937629 2.283896
H  -0.050904 -5.506953 0.36061
H  -0.628157 -4.905613 -1.185687
H  -1.777461 -5.27302 0.099694
H  -1.538091 -3.143491 -2.329587
H  4.280651 -1.156362 0.318819
H  2.025605 1.555112 1.477752
H  4.321586 -0.02533 -1.785596
H  4.049901 2.108625 -2.994609
H  2.711275 3.939602 -2.007637
H  0.834204 5.027287 2.490191
H  -0.323843 2.137475 -0.462619
H  -1.299797 4.656006 3.678692
H  -2.428982 1.756346 0.738064
H  -2.936834 3.010555 2.814984
elementType: Cl O N C H
totalener: -2050.68420940 hartree
nucrepener: 2841.15127373 hartree
electener: -4891.83548312 hartree
oneelecener: -8458.55467607 hartree
twoeener: 3566.71919295 hartree
cpcmener: -0.03338124 hartree
kineticenergy: 2044.47218947 hartree
xcener: -151.865506227000 hartree
chargesum: 0.0000000
charge: -0.060478 -0.059677 -0.280250 -0.444610 -0.332408 -0.083281 0.085246 0.029396 -0.088940 -0.263018 -0.262588 -0.205994 0.425340 0.048095 0.457987 -0.029540 -0.247499 -0.133118 -0.229785 0.209302 -0.117664 -0.216909 0.286678 -0.246776 -0.198553 -0.114970 -0.123370 -0.198522 0.078652 0.096565 0.094636 0.100840 0.098165 0.099588 0.089853 0.102318 0.132110 0.144829 0.141459 0.144531 0.159309 0.148554 0.145148 0.151924 0.157072 0.154441 0.155911
qa: -0.0605 -0.0597 -0.2802 -0.4446 -0.3324 -0.0833 0.0852 0.0294 -0.0889 -0.2630 -0.2626 -0.2060 0.4253 0.0481 0.4580 -0.0295 -0.2475 -0.1331 -0.2298 0.2093 -0.1177 -0.2169 0.2867 -0.2468 -0.1986 -0.1150 -0.1234 -0.1985 0.0787 0.0966 0.0946 0.1008 0.0982 0.0996 0.0899 0.1023 0.1321 0.1448 0.1415 0.1445 0.1593 0.1486 0.1451 0.1519 0.1571 0.1544 0.1559
va: 1.2667 1.2453 2.1434 2.0474 2.0772 3.1063 3.7463 3.8762 3.8650 3.9067 3.9035 3.8866 4.1448 4.1994 3.8411 3.6283 4.0614 3.8880 3.9981 3.8320 3.8910 4.0179 3.6862 4.0110 3.8773 3.8792 3.8708 3.9283 1.0370 1.0329 1.0184 0.9995 1.0003 1.0015 1.0055 1.0008 1.0162 0.9929 1.0223 1.0029 0.9889 1.0038 1.0078 1.0000 0.9888 0.9905 0.9913
dispcorr: -0.025616543 hartree
energy: -2050.709825939195
dipole: 14.47665 -13.80547 0.67119 -5.33821 3.78879 -1.54942 12.70095 -14.73347 -2.03252
magnitude: 2.64241 au
magnitude: 6.71647 debye
