program: Orca
programVersion: 5.0.2
elementType: Cl Cl O O O N C C C C C C C C C C C C C C C C C C C C C C H H H H H H H H H H H H H H H H H H H
charge: 0
multiplicity: 1
keywords: wb97x-d3
keywords: def2-TZVPP
keywords: def2/J RIJCOSX
keywords: DEFGRID2
keywords: scfconv7
keywords: smallprint printgap noloewdin
keywords: NOSOSCF
formula: C22H19Cl2NO3
InChI: InChI=1/C22H19Cl2NO3/c1-22(2)17(12-19(23)24)20(22)21(26)28-18(13-25)14-7-6-10-16(11-14)27-15-8-4-3-5-9-15/h3-12,17-18,20H,1-2H3
47 atoms
Cl -1.476064 -5.885726 -1.249487
Cl -2.802223 -6.627499 1.202578
O  1.326366 -0.685665 1.49496
O  1.387545 -1.673634 -0.506801
O  -0.211797 3.666559 -0.447595
N  3.420798 0.994426 3.41189
C  -1.738968 -1.666599 0.09257
C  -1.169313 -3.057557 0.099488
C  -0.509803 -1.978729 0.928209
C  -1.61552 -0.86299 -1.178069
C  -3.002975 -1.368014 0.860847
C  -1.838193 -4.163803 0.795652
C  0.812872 -1.468552 0.529755
C  -2.005293 -5.38764 0.311059
C  2.521739 0.006929 1.166888
C  2.282211 1.125614 0.177183
C  3.013444 0.547463 2.435601
C  1.161851 1.934733 0.316143
C  3.186922 1.345112 -0.850468
C  0.941789 2.956095 -0.595242
C  2.960122 2.380685 -1.746403
C  1.838558 3.186057 -1.633322
C  -0.241356 5.00709 -0.725947
C  0.761369 5.868936 -0.299047
C  -1.353475 5.490214 -1.399993
C  0.645195 7.225471 -0.564977
C  -1.461622 6.851274 -1.647968
C  -0.462584 7.723245 -1.238537
H  -0.634102 -3.327893 -0.803823
H  -0.681769 -2.003349 1.998694
H  -1.535784 0.203521 -0.957181
H  -2.509417 -1.007011 -1.787449
H  -0.760192 -1.145297 -1.78841
H  -3.083395 -0.296257 1.050128
H  -3.048565 -1.872349 1.825076
H  -3.879367 -1.669291 0.283761
H  -2.225707 -3.976426 1.790114
H  3.286647 -0.677896 0.785723
H  0.450745 1.779092 1.118985
H  4.057304 0.710541 -0.958351
H  3.656503 2.554175 -2.556036
H  1.66546 3.975731 -2.353277
H  1.622962 5.49405 0.23964
H  -2.12934 4.806559 -1.721566
H  1.426796 7.897201 -0.234206
H  -2.331466 7.2273 -2.171124
H  -0.546941 8.783071 -1.439443
elementType: Cl O N C H
totalener: -2050.68654833 hartree
nucrepener: 2695.11149426 hartree
electener: -4745.79804259 hartree
oneelecener: -8165.57725634 hartree
twoeener: 3419.77921376 hartree
cpcmener: -0.03153409 hartree
kineticenergy: 2044.47398354 hartree
xcener: -151.863816839997 hartree
chargesum: 0.0000000
charge: -0.054880 -0.059345 -0.281776 -0.428443 -0.330719 -0.086976 0.094696 0.030986 -0.070273 -0.267296 -0.262950 -0.205023 0.355055 0.039211 0.413891 0.040600 -0.230121 -0.270674 -0.200478 0.266971 -0.124602 -0.179412 0.261633 -0.180518 -0.238412 -0.150797 -0.128510 -0.176291 0.081391 0.100113 0.095972 0.102655 0.096798 0.098851 0.090837 0.102397 0.131148 0.144203 0.134908 0.145839 0.160543 0.159554 0.157700 0.146341 0.159295 0.157674 0.158236
qa: -0.0549 -0.0593 -0.2818 -0.4284 -0.3307 -0.0870 0.0947 0.0310 -0.0703 -0.2673 -0.2629 -0.2050 0.3551 0.0392 0.4139 0.0406 -0.2301 -0.2707 -0.2005 0.2670 -0.1246 -0.1794 0.2616 -0.1805 -0.2384 -0.1508 -0.1285 -0.1763 0.0814 0.1001 0.0960 0.1027 0.0968 0.0989 0.0908 0.1024 0.1311 0.1442 0.1349 0.1458 0.1605 0.1596 0.1577 0.1463 0.1593 0.1577 0.1582
va: 1.2704 1.2455 2.1200 2.0824 2.0542 3.1125 3.7365 3.8798 3.8283 3.9046 3.9037 3.8940 4.2449 4.2120 3.7077 3.5946 4.0821 4.0414 3.9948 3.7343 3.9017 3.9273 3.7146 3.9026 4.0042 3.8940 3.8920 3.8971 1.0482 1.0320 1.0011 1.0015 1.0160 1.0021 1.0052 1.0009 1.0172 1.0154 1.0294 1.0026 0.9904 0.9940 0.9970 1.0074 0.9905 0.9895 0.9902
dispcorr: -0.023982664 hartree
energy: -2050.710530989646
dipole: -0.43769 -0.35170 -0.78939 42.59368 -41.37756 1.21612 -7.00447 5.93600 -1.06847
magnitude: 1.80104 au
magnitude: 4.57787 debye
