program: Orca
programVersion: 5.0.2
elementType: Cl Cl O O O N C C C C C C C C C C C C C C C C C C C C C C H H H H H H H H H H H H H H H H H H H
charge: 0
multiplicity: 1
keywords: wb97x-d3
keywords: def2-TZVPP
keywords: def2/J RIJCOSX
keywords: DEFGRID2
keywords: scfconv7
keywords: smallprint printgap noloewdin
keywords: NOSOSCF
formula: C22H19Cl2NO3
InChI: InChI=1/C22H19Cl2NO3/c1-22(2)17(12-19(23)24)20(22)21(26)28-18(13-25)14-7-6-10-16(11-14)27-15-8-4-3-5-9-15/h3-12,17-18,20H,1-2H3
47 atoms
Cl -3.316738 -0.397498 2.14251
Cl -4.873473 -0.427111 -0.286177
O  2.016866 -1.41181 -1.102113
O  1.704847 -1.620816 1.098337
O  0.922514 3.366399 0.23389
N  4.875299 -2.392263 0.475803
C  -0.691272 -3.454913 0.239025
C  -1.220501 -2.07133 0.478729
C  -0.024483 -2.274297 -0.437653
C  -0.028339 -4.162765 1.394268
C  -1.43423 -4.396428 -0.677788
C  -2.477871 -1.606887 -0.120184
C  1.286085 -1.753557 -0.021156
C  -3.418156 -0.906583 0.502072
C  3.284099 -0.828294 -0.890829
C  3.241579 0.58351 -0.331514
C  4.144703 -1.710074 -0.089772
C  2.051292 1.299516 -0.319345
C  4.423526 1.177058 0.09233
C  2.049328 2.610502 0.142222
C  4.404437 2.488121 0.544986
C  3.225182 3.211225 0.574729
C  -0.229766 2.986374 -0.40925
C  -1.350862 2.720111 0.362104
C  -0.28646 2.934945 -1.795651
C  -2.548647 2.407957 -0.266444
C  -1.485491 2.604568 -2.410392
C  -2.618414 2.339769 -1.650641
H  -0.980163 -1.660377 1.452763
H  -0.222437 -2.184833 -1.499529
H  -0.764095 -4.790465 1.900379
H  0.387032 -3.485765 2.137075
H  0.773127 -4.815728 1.043483
H  -1.832117 -3.909071 -1.567075
H  -2.267863 -4.864069 -0.1506
H  -0.767875 -5.192239 -1.015377
H  -2.664363 -1.855958 -1.157978
H  3.733671 -0.79158 -1.887765
H  1.128732 0.85339 -0.665241
H  5.359094 0.631786 0.072782
H  5.323042 2.953406 0.877249
H  3.210179 4.233125 0.932033
H  -1.289661 2.768899 1.442069
H  0.59299 3.15389 -2.389697
H  -3.42938 2.218303 0.332933
H  -1.533548 2.561494 -3.490868
H  -3.55187 2.088369 -2.136766
elementType: Cl O N C H
totalener: -2050.68404526 hartree
nucrepener: 2911.25756219 hartree
electener: -4961.94160745 hartree
oneelecener: -8598.16602607 hartree
twoeener: 3636.22441863 hartree
cpcmener: -0.03339987 hartree
kineticenergy: 2044.45427777 hartree
xcener: -151.867157199661 hartree
chargesum: -0.0000000
charge: -0.055483 -0.059893 -0.290133 -0.425514 -0.322577 -0.087822 0.090523 0.043879 -0.083016 -0.268796 -0.262943 -0.208965 0.373567 0.048646 0.473445 -0.029767 -0.241783 -0.230695 -0.249340 0.332804 -0.097602 -0.257685 0.268456 -0.219274 -0.191511 -0.117438 -0.142407 -0.167964 0.087596 0.096329 0.098077 0.095998 0.101177 0.090218 0.102126 0.099408 0.129032 0.154194 0.134922 0.137938 0.157582 0.144800 0.143929 0.154993 0.140362 0.159253 0.151356
qa: -0.0555 -0.0599 -0.2901 -0.4255 -0.3226 -0.0878 0.0905 0.0439 -0.0830 -0.2688 -0.2629 -0.2090 0.3736 0.0486 0.4734 -0.0298 -0.2418 -0.2307 -0.2493 0.3328 -0.0976 -0.2577 0.2685 -0.2193 -0.1915 -0.1174 -0.1424 -0.1680 0.0876 0.0963 0.0981 0.0960 0.1012 0.0902 0.1021 0.0994 0.1290 0.1542 0.1349 0.1379 0.1576 0.1448 0.1439 0.1550 0.1404 0.1593 0.1514
va: 1.2688 1.2450 2.1320 2.0780 2.0921 3.1032 3.7637 3.8501 3.8644 3.9036 3.9071 3.9024 4.1632 4.2132 3.7810 3.7935 4.0915 3.9405 4.0022 3.7105 3.9035 4.0170 3.7048 4.0112 3.9435 3.8253 3.9129 3.8813 1.0441 1.0367 1.0000 1.0191 0.9996 1.0057 1.0007 1.0014 1.0195 0.9882 1.0225 1.0109 0.9897 1.0086 1.0107 0.9971 1.0125 0.9896 1.0012
dispcorr: -0.027907658 hartree
energy: -2050.711952918432
dipole: 13.05414 -14.14615 -1.09202 -9.54248 9.54469 0.00221 -8.23483 5.88825 -2.34658
magnitude: 2.58823 au
magnitude: 6.57876 debye
