program: Orca
programVersion: 5.0.2
elementType: Cl Cl O O O N C C C C C C C C C C C C C C C C C C C C C C H H H H H H H H H H H H H H H H H H H
charge: 0
multiplicity: 1
keywords: wb97x-d3
keywords: def2-TZVPP
keywords: def2/J RIJCOSX
keywords: DEFGRID2
keywords: scfconv7
keywords: smallprint printgap noloewdin
keywords: NOSOSCF
formula: C22H19Cl2NO3
InChI: InChI=1/C22H19Cl2NO3/c1-22(2)17(12-19(23)24)20(22)21(26)28-18(13-25)14-7-6-10-16(11-14)27-15-8-4-3-5-9-15/h3-12,17-18,20H,1-2H3
47 atoms
Cl -1.483266 -6.055471 -0.930077
Cl -2.812219 -6.594978 1.573563
O  1.276923 -0.67417 1.358825
O  1.258388 -1.709185 -0.620799
O  -0.170636 3.773285 -0.475394
N  3.496855 0.957247 3.179939
C  -1.838299 -1.721334 0.053737
C  -1.255761 -3.103022 0.151567
C  -0.590619 -1.958468 0.885916
C  -1.749008 -1.012144 -1.275112
C  -3.089877 -1.377293 0.823986
C  -1.900313 -4.15892 0.942533
C  0.721284 -1.471194 0.429054
C  -2.040588 -5.425048 0.571276
C  2.476845 -0.015775 0.981103
C  2.226191 1.105977 -0.001208
C  3.033882 0.519529 2.224701
C  1.156834 1.968609 0.205437
C  3.071562 1.277698 -1.086522
C  0.928991 2.997268 -0.694767
C  2.836072 2.318932 -1.973826
C  1.76443 3.177625 -1.792457
C  -0.123138 5.117022 -0.737127
C  -1.234613 5.686295 -1.340822
C  0.963084 5.89997 -0.365298
C  -1.257271 7.054075 -1.575102
C  0.931141 7.263692 -0.617023
C  -0.174017 7.846818 -1.222697
H  -0.733467 -3.433653 -0.739114
H  -0.742795 -1.908972 1.958411
H  -2.664374 -1.18901 -1.842719
H  -0.917409 -1.347955 -1.890925
H  -1.652691 0.066536 -1.134883
H  -3.108572 -1.801934 1.826734
H  -3.973954 -1.734038 0.292002
H  -3.180972 -0.294751 0.92825
H  -2.293949 -3.892669 1.916201
H  3.206851 -0.721983 0.571595
H  0.495362 1.851751 1.055888
H  3.903442 0.603086 -1.243763
H  3.485933 2.455455 -2.828037
H  1.582943 3.972998 -2.504002
H  -2.075756 5.064077 -1.620072
H  1.825603 5.459109 0.11908
H  -2.126047 7.497093 -2.044608
H  1.778415 7.873408 -0.330627
H  -0.191328 8.911465 -1.414726
elementType: Cl O N C H
totalener: -2050.68675661 hartree
nucrepener: 2686.53901156 hartree
electener: -4737.22576816 hartree
oneelecener: -8148.43755775 hartree
twoeener: 3411.21178959 hartree
cpcmener: -0.03140744 hartree
kineticenergy: 2044.47444860 hartree
xcener: -151.863820406522 hartree
chargesum: -0.0000000
charge: -0.054876 -0.059682 -0.283213 -0.431258 -0.330372 -0.086461 0.091752 0.032196 -0.069319 -0.266218 -0.264181 -0.204648 0.359870 0.039976 0.418247 0.031583 -0.231383 -0.254214 -0.198416 0.249649 -0.126725 -0.173445 0.260629 -0.237351 -0.177742 -0.128081 -0.150422 -0.177071 0.081629 0.099334 0.101129 0.096769 0.097880 0.090996 0.102462 0.098680 0.130104 0.143284 0.135186 0.146180 0.160890 0.158766 0.146241 0.157038 0.156986 0.159252 0.158371
qa: -0.0549 -0.0597 -0.2832 -0.4313 -0.3304 -0.0865 0.0918 0.0322 -0.0693 -0.2662 -0.2642 -0.2046 0.3599 0.0400 0.4182 0.0316 -0.2314 -0.2542 -0.1984 0.2496 -0.1267 -0.1734 0.2606 -0.2374 -0.1777 -0.1281 -0.1504 -0.1771 0.0816 0.0993 0.1011 0.0968 0.0979 0.0910 0.1025 0.0987 0.1301 0.1433 0.1352 0.1462 0.1609 0.1588 0.1462 0.1570 0.1570 0.1593 0.1584
va: 1.2708 1.2450 2.1209 2.0805 2.0601 3.1129 3.7372 3.8794 3.8293 3.9059 3.9052 3.8948 4.2354 4.2123 3.7056 3.6034 4.0829 4.0460 3.9896 3.7603 3.9008 3.9200 3.7133 4.0024 3.8976 3.8925 3.8923 3.8971 1.0477 1.0323 1.0010 1.0165 0.9996 1.0054 1.0006 1.0019 1.0180 1.0161 1.0294 1.0026 0.9903 0.9941 1.0076 0.9970 0.9897 0.9904 0.9901
dispcorr: -0.023688806 hartree
energy: -2050.710445412481
dipole: -0.57460 -0.27037 -0.84497 42.77478 -41.54989 1.22489 -9.12637 7.99468 -1.13169
magnitude: 1.86950 au
magnitude: 4.75190 debye
