program: Orca
programVersion: 5.0.2
elementType: Cl Cl O O O N C C C C C C C C C C C C C C C C C C C C C C H H H H H H H H H H H H H H H H H H H
charge: 0
multiplicity: 1
keywords: wb97x-d3
keywords: def2-TZVPP
keywords: def2/J RIJCOSX
keywords: DEFGRID2
keywords: scfconv7
keywords: smallprint printgap noloewdin
keywords: NOSOSCF
formula: C22H19Cl2NO3
InChI: InChI=1/C22H19Cl2NO3/c1-22(2)17(12-19(23)24)20(22)21(26)28-18(13-25)14-7-6-10-16(11-14)27-15-8-4-3-5-9-15/h3-12,17-18,20H,1-2H3
47 atoms
Cl -0.143886 -0.212373 -2.307539
Cl -1.992425 -1.289484 -4.249155
O  2.025882 -1.798226 0.506658
O  0.373444 -0.93691 1.738839
O  0.593482 3.55634 0.460978
N  3.156544 -0.482954 3.490481
C  -1.367619 -3.263721 0.556388
C  -1.513977 -2.041282 -0.275863
C  -0.120358 -2.55653 0.048169
C  -1.752938 -3.205503 2.01325
C  -1.625921 -4.608781 -0.077633
C  -1.975021 -2.066316 -1.680281
C  0.732852 -1.691551 0.869443
C  -1.446758 -1.292864 -2.618467
C  2.925172 -0.765553 0.902607
C  2.606801 0.516237 0.171139
C  3.000883 -0.609489 2.357573
C  1.814457 1.506016 0.73349
C  3.042013 0.631788 -1.145153
C  1.408339 2.578154 -0.048639
C  2.666754 1.732112 -1.898899
C  1.829972 2.700945 -1.363074
C  -0.469551 3.170531 1.24644
C  -0.7526 3.939967 2.36475
C  -1.258503 2.07396 0.918728
C  -1.837247 3.604559 3.164321
C  -2.328817 1.741725 1.735535
C  -2.623593 2.502087 2.85993
H  -1.792139 -1.141018 0.268478
H  0.396059 -3.064096 -0.757913
H  -2.782108 -3.549489 2.127702
H  -1.697011 -2.204982 2.435092
H  -1.118597 -3.8637 2.608807
H  -1.300761 -4.65245 -1.117366
H  -2.691374 -4.843404 -0.049326
H  -1.099176 -5.393471 0.466977
H  -2.794252 -2.720846 -1.954591
H  3.905158 -1.129217 0.586712
H  1.497255 1.444131 1.766224
H  3.668357 -0.137383 -1.578887
H  3.008692 1.827344 -2.920486
H  1.509029 3.54509 -1.959656
H  -0.130484 4.79187 2.607814
H  -1.046683 1.478836 0.039282
H  -2.057321 4.205071 4.037135
H  -2.93879 0.88376 1.483439
H  -3.460096 2.237794 3.492779
elementType: Cl O N C H
totalener: -2050.66774074 hartree
nucrepener: 2996.95225324 hartree
electener: -5047.61999398 hartree
oneelecener: -8770.31449572 hartree
twoeener: 3722.69450174 hartree
cpcmener: -0.03902219 hartree
kineticenergy: 2044.47576382 hartree
xcener: -151.869574019688 hartree
chargesum: 0.0000000
charge: -0.056687 -0.058169 -0.285032 -0.465474 -0.344008 -0.097695 0.157208 -0.055813 -0.066222 -0.275825 -0.281167 -0.232039 0.375239 0.107281 0.468757 -0.008816 -0.236892 -0.143593 -0.244688 0.228278 -0.131904 -0.214670 0.267638 -0.230044 -0.168309 -0.138633 -0.177259 -0.169887 0.106020 0.110821 0.097298 0.090323 0.102663 0.094307 0.103072 0.100266 0.143560 0.144394 0.142033 0.144940 0.161261 0.149974 0.148268 0.149390 0.161016 0.167464 0.161357
qa: -0.0567 -0.0582 -0.2850 -0.4655 -0.3440 -0.0977 0.1572 -0.0558 -0.0662 -0.2758 -0.2812 -0.2320 0.3752 0.1073 0.4688 -0.0088 -0.2369 -0.1436 -0.2447 0.2283 -0.1319 -0.2147 0.2676 -0.2300 -0.1683 -0.1386 -0.1773 -0.1699 0.1060 0.1108 0.0973 0.0903 0.1027 0.0943 0.1031 0.1003 0.1436 0.1444 0.1420 0.1449 0.1613 0.1500 0.1483 0.1494 0.1610 0.1675 0.1614
va: 1.3024 1.2490 2.1297 2.0199 2.0662 3.1048 3.7189 3.8937 3.8325 3.8917 3.9117 3.9044 4.1188 4.1574 3.8593 3.5803 4.0728 3.8954 3.9588 3.7837 3.8429 3.9808 3.6953 3.9881 3.8448 3.8907 3.8951 3.8857 1.0154 1.0257 1.0012 1.0162 0.9988 0.9991 0.9991 1.0025 1.0083 0.9937 1.0200 1.0044 0.9890 1.0031 1.0063 1.0034 0.9875 0.9854 0.9889
dispcorr: -0.030511699 hartree
energy: -2050.698252439950
dipole: -7.93317 7.20118 -0.73199 -9.35360 7.64450 -1.70910 19.66978 -21.69444 -2.02465
magnitude: 2.74883 au
magnitude: 6.98696 debye
