program: Gaussian 09
title: 000060303
version: EM64L-G09RevD.01
frameworkgroup: C1[X(C20H19NO3S)]
method: RPBEPBE
basis: SDD
operation: Freq
keyword: #p
keyword: freq=noraman
keyword: PBEPBE/SDD
title: #p freq=noraman PBEPBE/SDD
converged: YES YES NO NO
title: Mulliken charges:
elementType: S O O O N C C C C C C C C C C C C C C C C C C C C H H H H H H H H H H H H H H H H H H H
charge: 0.253360 -0.281155 -0.205127 -0.150286 -0.332480 0.011890 -0.447947 -0.551955 0.370928 -0.614193 0.155160 0.497668 -0.584857 -0.555368 -0.385548 0.489350 -0.586173 -0.390985 0.268229 -0.369382 -0.441920 -0.090997 -0.233465 -0.224966 -0.243343 0.236894 0.211493 0.229499 0.225816 0.233268 0.232575 0.200802 0.244880 0.257219 0.240016 0.247545 0.328123 0.237659 0.251590 0.227314 0.364996 0.223249 0.223514 0.227112
chargesum: 0.00000
title: Mulliken charges with hydrogens summed into heavy atoms:
elementType: S O O O N C C C C C C C C C C C C C C C C C C C C
charge: 0.253360 -0.281155 -0.205127 -0.150286 0.032516 0.248784 -0.006955 -0.092872 0.370928 -0.180815 0.155160 0.497668 -0.339978 -0.058133 -0.138003 0.489350 -0.258051 -0.153326 0.268229 -0.117792 -0.214606 -0.090997 -0.010216 -0.001452 -0.016231
polarizability: 3.24779157e+02 1.32740814e+00 2.25947006e+02 -2.02333720e+01 2.85584865e+01 1.91021528e+02
1716.lowfreq: -3.7362 -0.0020 -0.0015 -0.0009 3.0878 5.7592 12.0607 14.9110 25.6856
frequency: 8.8692 14.8882 25.5254 29.6038 41.7566 48.0413 70.1993 75.5125 139.4945 151.9503 158.3191 167.4196 176.2120 222.1814 236.6272 281.8679 309.2616 325.3007 346.2487 371.1440 401.5754 404.3173 422.6270 434.1119 437.0654 454.5771 466.4026 485.1493 507.3125 536.5596 563.3022 584.1945 595.2419 598.3067 601.9695 618.4425 621.5811 664.1823 691.4993 704.1810 723.8842 733.7000 737.6708 754.3952 758.4430 808.7734 827.2643 853.0209 853.3877 863.3843 886.0921 898.6847 913.8221 920.3452 924.7750 950.3316 956.5803 975.6881 990.1902 993.5054 994.9495 1026.7822 1028.5660 1043.2645 1063.7151 1077.2620 1091.0306 1120.8998 1125.9570 1142.5922 1161.5740 1168.8952 1171.8732 1188.6530 1198.2674 1203.7290 1214.4773 1216.3471 1217.8260 1252.8353 1262.6395 1270.5280 1277.4746 1280.8974 1320.4364 1324.9070 1329.6611 1338.8326 1339.7378 1352.4244 1360.0168 1383.0174 1388.1019 1429.5445 1440.9472 1449.8867 1457.4372 1461.6631 1462.6960 1484.1453 1489.9212 1587.8626 1593.1066 1614.9124 1624.9577 1650.6118 1684.8756 2970.1115 2973.3615 2990.6409 2995.0489 2997.8134 3035.5025 3049.1909 3050.1131 3062.9808 3066.3803 3111.5586 3111.9886 3120.3483 3124.6565 3137.8611 3152.3410 3163.4338 3164.7968 3531.1156
redmass: 4.2605 7.9039 5.6857 7.5783 5.0851 7.4754 5.7805 5.2131 5.0811 5.4636 7.4329 5.8853 3.8642 3.0349 3.4995 4.7496 2.8146 3.1428 9.4875 3.4613 3.4210 2.8528 2.8958 3.4134 8.1896 4.0703 3.1301 5.9907 3.6652 4.2601 8.8986 4.6830 4.4660 4.4345 3.3345 6.0232 4.7301 3.8566 3.6436 1.7803 5.1801 3.7620 1.9011 2.7615 1.8651 4.0438 1.4676 3.2206 1.2890 1.8982 2.1483 1.7790 2.7696 2.1355 1.5830 1.8089 1.5400 1.3990 4.9664 1.9368 1.6106 2.8506 3.1524 2.3769 2.7040 1.9861 1.7553 1.6767 4.2748 1.2399 1.4659 1.3216 1.0635 1.1275 1.4845 1.3264 1.5179 1.6229 2.0408 2.6294 2.0298 2.2437 1.3206 1.3668 1.3718 1.3528 1.5039 1.3907 1.3178 1.6379 1.6290 6.9213 5.7774 3.5576 2.1002 1.1196 1.1326 1.1194 1.1100 2.3235 2.6225 7.0471 6.0452 6.1542 6.8560 7.5787 12.3029 1.0742 1.0739 1.0602 1.0603 1.0619 1.0953 1.1022 1.0894 1.1027 1.0969 1.0873 1.0912 1.0897 1.0863 1.0924 1.0956 1.0949 1.1007 1.0780
irintensity: 0.0142 0.0871 0.6580 0.0503 0.3411 0.0678 0.7958 0.7151 1.2116 7.2116 7.0586 1.0117 1.1037 0.8649 2.1620 0.2680 0.9381 1.2591 12.2338 1.5597 2.1726 0.0730 1.2808 3.6405 8.2300 2.1592 9.5626 17.7031 11.7178 12.2717 2.9065 5.4342 4.0254 9.2149 5.1719 1.7528 25.6648 40.4904 13.5554 59.8045 4.5898 7.7435 77.7448 38.1931 43.2280 4.0077 42.5661 39.5328 3.1764 1.3879 2.4335 10.4679 1.8897 1.3396 2.0407 14.0136 1.3769 0.2583 2.8017 21.6371 10.1899 4.9058 8.4192 10.9173 24.3300 6.9233 19.8421 99.2311 143.0407 27.2319 33.5820 1.2674 0.1637 5.8886 68.7937 32.4429 59.1257 14.1280 11.4399 159.3927 26.6465 105.4056 1.5967 2.3648 25.7055 0.6639 2.3455 1.0956 10.0096 4.9714 7.3615 0.6300 19.1452 4.9484 6.0019 2.7799 7.6841 14.3793 22.6999 34.7810 130.2265 22.2024 1.0423 8.3920 19.0080 486.4011 354.2307 10.0783 32.7783 8.0720 12.4381 54.0508 27.5868 3.2959 1.3181 51.4636 7.4673 9.9462 14.3838 14.7434 0.2750 27.5775 38.8341 6.1544 15.5362 65.9824
temp: 298.150 k
press: 1.00000 atm
elementType: 16 8 8 8 7 6 6 6 6 6 6 6 6 6 6 6 6 6 6 6 6 6 6 6 6 1 1 1 1 1 1 1 1 1 1 1 1 1 1 1 1 1 1 1
symmnumber: 1
zpe: 906153.0 jmol-1
zpe.correction: 0.345135 hartree
zpe.thermalcorrener: 0.366998 hartree
zpe.thermalcorrenthalpy: 0.367942 hartree
zpe.thermalcorrgfe: 0.289284 hartree
zpe.sumelectzpe: -1450.265998 hartree
zpe.sumelectthermal: -1450.244136 hartree
zpe.sumelectthermalent: -1450.243192 hartree
zpe.sumelectthermalfe: -1450.321849 hartree
dipole: -2.1583 1.5043 -0.8939
dipole: 2.7785
quadrupole: -160.6823 -142.8403 -164.2465
quadrupole: -5.8555 -11.0357 -5.6226
quadrupole: -4.7593 13.0828 -8.3235 -5.8555 -11.0357 -5.6226
hfenergy: -1450.6111338 hartree
pointgroup: C01 [X(C20H19N1O3S1)]
dipole: -0.8382344 -0.580595 0.3940555 debye
polarizability: 324.9409689|1.6385634|229.5884003|19.2105884|26.3117988|187.2183217 unknown
InChI: InChI=1S/C20H19NO3S/c22-19-18(25-20(23)21-19)12-14-6-9-17-15(10-14)7-8-16(24-17)11-13-4-2-1-3-5-13/h1-6,9-10,16,18,21H,7-8,11-12H2
charge 0 multiplicity 1
44 atoms
S  4.026957 -0.308469 -1.507273
O  -2.162855 -0.114008 0.873372
O  6.142401 1.953488 1.030655
O  6.471488 -0.958223 -2.639403
N  6.467592 0.526145 -0.804774
C  -2.770687 -1.336901 0.267404
C  -2.077484 -2.593654 0.824572
C  -0.579037 -2.582675 0.448313
C  0.055493 -1.233028 0.759018
C  -4.277241 -1.264971 0.587375
C  -0.758632 -0.085224 0.957385
C  2.058564 0.158781 1.192513
C  1.456494 -1.082631 0.881407
C  3.56931 0.303128 1.277146
C  -0.181954 1.165047 1.28492
C  -5.034218 -0.193617 -0.187037
C  4.187437 0.882192 -0.025686
C  1.21471 1.282844 1.400206
C  5.680321 1.19809 0.141503
C  -4.920438 1.178915 0.157016
C  -5.863607 -0.550743 -1.281181
C  5.864742 -0.315523 -1.7649
C  -5.615525 2.165834 -0.576263
C  -6.560008 0.434714 -2.018438
C  -6.437793 1.798338 -1.667439
H  -2.608079 -1.2739 -0.829304
H  -2.569799 -3.494754 0.414109
H  -2.202772 -2.612666 1.924459
H  -0.470458 -2.807845 -0.632301
H  -0.040453 -3.383398 0.988431
H  -4.373136 -1.103841 1.678256
H  -4.710428 -2.258482 0.362699
H  2.094219 -1.963721 0.730239
H  3.850028 1.003246 2.087817
H  4.049036 -0.668123 1.496076
H  -0.842518 2.023045 1.443025
H  3.660869 1.811518 -0.303261
H  1.653586 2.253699 1.662739
H  -4.275176 1.466179 0.993682
H  -5.970009 -1.608366 -1.555175
H  7.486232 0.635398 -0.806735
H  -5.517026 3.221317 -0.2975
H  -7.198188 0.139234 -2.85914
H  -6.978153 2.564711 -2.234627
