program: Orca
programVersion: 5.0.2
elementType: Cl Cl O O O N C C C C C C C C C C C C C C C C C C C C C C H H H H H H H H H H H H H H H H H H H
charge: 0
multiplicity: 1
keywords: wb97x-d3
keywords: def2-TZVPP
keywords: def2/J RIJCOSX
keywords: DEFGRID2
keywords: scfconv7
keywords: smallprint printgap noloewdin
keywords: NOSOSCF
formula: C22H19Cl2NO3
InChI: InChI=1/C22H19Cl2NO3/c1-22(2)17(12-19(23)24)20(22)21(26)28-18(13-25)14-7-6-10-16(11-14)27-15-8-4-3-5-9-15/h3-12,17-18,20H,1-2H3
47 atoms
Cl -4.417811 -3.8592 0.946341
Cl -3.440552 -6.499562 0.319899
O  1.078046 -1.10243 -0.832806
O  -0.772763 -0.316322 0.142186
O  1.406257 4.701476 0.531743
N  3.104691 -0.139657 -3.257353
C  -0.221923 -2.787182 2.03404
C  -1.373871 -3.076707 1.116438
C  -0.06508 -2.574997 0.53917
C  -0.350077 -1.610149 2.969203
C  0.581163 -3.92106 2.622331
C  -1.78937 -4.447812 0.798119
C  -0.00267 -1.225231 -0.041299
C  -3.044244 -4.867349 0.702324
C  1.305516 0.183284 -1.389438
C  1.821065 1.176254 -0.372108
C  2.311891 -0.018647 -2.432917
C  1.345245 2.477559 -0.407434
C  2.773641 0.790053 0.562983
C  1.851897 3.409585 0.489783
C  3.243977 1.724946 1.471576
C  2.796823 3.037113 1.434609
C  1.091981 5.367126 -0.628721
C  0.010803 6.235346 -0.579803
C  1.848682 5.238546 -1.78709
C  -0.317052 6.979974 -1.704134
C  1.4993 5.978823 -2.907587
C  0.418649 6.850115 -2.873914
H  -2.167594 -2.33888 1.147793
H  0.5562 -3.309518 0.039926
H  0.62127 -1.142766 3.140023
H  -0.722846 -1.956574 3.934202
H  -1.037166 -0.846382 2.613038
H  0.07591 -4.327627 3.499962
H  1.559363 -3.55839 2.941009
H  0.747778 -4.737367 1.921502
H  -1.014443 -5.183308 0.618442
H  0.404435 0.570342 -1.876255
H  0.587929 2.754328 -1.130881
H  3.149185 -0.224615 0.589068
H  3.980219 1.435284 2.209086
H  3.175912 3.768367 2.136845
H  -0.564608 6.33153 0.332203
H  2.702774 4.574421 -1.824928
H  -1.158983 7.658511 -1.662972
H  2.085281 5.875353 -3.811376
H  0.154782 7.425303 -3.75117
elementType: Cl O N C H
totalener: -2050.67295369 hartree
nucrepener: 2677.05486711 hartree
electener: -4727.72782079 hartree
oneelecener: -8129.46304471 hartree
twoeener: 3401.73522392 hartree
cpcmener: -0.03760836 hartree
kineticenergy: 2044.45551850 hartree
xcener: -151.862359225365 hartree
chargesum: 0.0000000
charge: -0.057192 -0.061085 -0.283307 -0.461162 -0.337090 -0.101085 0.091514 0.030993 -0.069966 -0.265510 -0.265268 -0.202189 0.390817 0.038448 0.417682 0.021715 -0.219899 -0.196208 -0.230422 0.274556 -0.126518 -0.224731 0.297663 -0.258312 -0.200953 -0.120531 -0.142953 -0.192816 0.080565 0.101214 0.098731 0.100804 0.094088 0.101320 0.099044 0.093450 0.134735 0.144544 0.148639 0.150010 0.161847 0.151325 0.148753 0.158958 0.161490 0.162773 0.161518
qa: -0.0572 -0.0611 -0.2833 -0.4612 -0.3371 -0.1011 0.0915 0.0310 -0.0700 -0.2655 -0.2653 -0.2022 0.3908 0.0384 0.4177 0.0217 -0.2199 -0.1962 -0.2304 0.2746 -0.1265 -0.2247 0.2977 -0.2583 -0.2010 -0.1205 -0.1430 -0.1928 0.0806 0.1012 0.0987 0.1008 0.0941 0.1013 0.0990 0.0934 0.1347 0.1445 0.1486 0.1500 0.1618 0.1513 0.1488 0.1590 0.1615 0.1628 0.1615
va: 1.2685 1.2439 2.1253 2.0480 2.0712 3.1103 3.7359 3.8814 3.8370 3.9045 3.9073 3.8957 4.1877 4.2092 3.7047 3.5956 4.0840 3.9761 3.9519 3.7235 3.9059 4.0036 3.6707 4.0089 3.9083 3.8749 3.8840 3.9039 1.0473 1.0325 1.0006 1.0009 1.0171 1.0009 1.0011 1.0051 1.0164 1.0186 1.0045 1.0119 0.9882 1.0039 1.0076 0.9964 0.9879 0.9890 0.9894
dispcorr: -0.023428882 hartree
energy: -2050.696382568478
dipole: 23.11334 -22.59720 0.51614 26.09445 -26.19753 -0.10308 8.54232 -7.29532 1.24701
magnitude: 1.35353 au
magnitude: 3.44040 debye
