program: Orca
programVersion: 5.0.2
elementType: Cl Cl O O O N C C C C C C C C C C C C C C C C C C C C C C H H H H H H H H H H H H H H H H H H H
charge: 0
multiplicity: 1
keywords: wb97x-d3
keywords: def2-TZVPP
keywords: def2/J RIJCOSX
keywords: DEFGRID2
keywords: scfconv7
keywords: smallprint printgap noloewdin
keywords: NOSOSCF
formula: C22H19Cl2NO3
InChI: InChI=1/C22H19Cl2NO3/c1-22(2)17(12-19(23)24)20(22)21(26)28-18(13-25)14-7-6-10-16(11-14)27-15-8-4-3-5-9-15/h3-12,17-18,20H,1-2H3
47 atoms
Cl -2.479055 -0.07331 1.115423
Cl -4.250777 -0.242486 -1.149027
O  1.812896 -1.783391 0.329756
O  2.491757 -2.116277 -1.769575
O  0.579041 3.007924 -0.912063
N  3.066723 -0.717045 3.181953
C  -0.446367 -3.800717 -0.412501
C  -0.892024 -2.375544 -0.283426
C  0.276049 -2.720279 -1.193481
C  0.19193 -4.447247 0.791513
C  -1.2507 -4.770087 -1.243463
C  -2.11645 -1.841778 -0.889423
C  1.630072 -2.204711 -0.929696
C  -2.84198 -0.858233 -0.370709
C  2.983603 -1.025668 0.588206
C  2.941635 0.335959 -0.071257
C  3.01939 -0.867743 2.042804
C  1.742793 1.038304 -0.12868
C  4.105899 0.867572 -0.603891
C  1.72602 2.287633 -0.732582
C  4.072549 2.122363 -1.195472
C  2.888476 2.837027 -1.260151
C  -0.416101 3.045731 0.033304
C  -1.710355 3.198894 -0.446221
C  -0.163668 3.017601 1.39849
C  -2.75895 3.33687 0.449505
C  -1.227344 3.141882 2.282522
C  -2.524008 3.30763 1.817044
H  -0.609119 -1.913409 0.653921
H  0.066279 -2.732872 -2.257029
H  -0.575101 -4.951412 1.381527
H  0.69334 -3.740186 1.448478
H  0.919043 -5.200421 0.4839
H  -1.639314 -4.32827 -2.159931
H  -2.096026 -5.150643 -0.667955
H  -0.6327 -5.622643 -1.528868
H  -2.442428 -2.250844 -1.838016
H  3.888342 -1.565901 0.290293
H  0.832582 0.615765 0.280399
H  5.029587 0.304892 -0.562839
H  4.974976 2.545806 -1.615016
H  2.857627 3.812759 -1.7276
H  -1.889968 3.220435 -1.513651
H  0.843797 2.909912 1.779434
H  -3.765567 3.460474 0.072308
H  -1.031735 3.118653 3.346619
H  -3.344553 3.40839 2.514631
elementType: Cl O N C H
totalener: -2050.66861462 hartree
nucrepener: 2945.93611002 hartree
electener: -4996.60472464 hartree
oneelecener: -8667.56853797 hartree
twoeener: 3670.96381334 hartree
cpcmener: -0.03723486 hartree
kineticenergy: 2044.46315343 hartree
xcener: -151.867153993290 hartree
chargesum: 0.0000000
charge: -0.057300 -0.066329 -0.283107 -0.455447 -0.334705 -0.099459 0.086894 0.037961 -0.065698 -0.258028 -0.273890 -0.219117 0.396093 0.064795 0.387953 0.018450 -0.221757 -0.199936 -0.218078 0.297580 -0.103772 -0.250553 0.346274 -0.285378 -0.223011 -0.116161 -0.132750 -0.200908 0.085788 0.101529 0.097652 0.093839 0.099898 0.093715 0.102047 0.099068 0.134335 0.151068 0.132081 0.148613 0.161786 0.150118 0.146251 0.156650 0.156275 0.161197 0.157475
qa: -0.0573 -0.0663 -0.2831 -0.4554 -0.3347 -0.0995 0.0869 0.0380 -0.0657 -0.2580 -0.2739 -0.2191 0.3961 0.0648 0.3880 0.0184 -0.2218 -0.1999 -0.2181 0.2976 -0.1038 -0.2506 0.3463 -0.2854 -0.2230 -0.1162 -0.1328 -0.2009 0.0858 0.1015 0.0977 0.0938 0.0999 0.0937 0.1020 0.0991 0.1343 0.1511 0.1321 0.1486 0.1618 0.1501 0.1463 0.1566 0.1563 0.1612 0.1575
va: 1.2781 1.2396 2.1143 2.0475 2.0792 3.1042 3.7764 3.8133 3.8274 3.9051 3.9138 3.9183 4.1716 4.1831 3.7389 3.6171 4.0744 3.9810 3.9846 3.7020 3.8792 4.0044 3.6096 3.9729 3.9098 3.8330 3.8481 3.8714 1.0421 1.0271 0.9999 1.0111 1.0007 1.0050 1.0003 1.0010 1.0188 1.0129 1.0120 1.0014 0.9880 1.0052 1.0089 0.9979 0.9910 0.9890 0.9908
dispcorr: -0.028580857 hartree
energy: -2050.697195476434
dipole: 11.23814 -11.51929 -0.28115 -12.55978 11.43695 -1.12283 -1.48499 0.59518 -0.88982
magnitude: 1.45999 au
magnitude: 3.71099 debye
