program: Orca
programVersion: 5.0.2
elementType: Cl Cl O O O N C C C C C C C C C C C C C C C C C C C C C C H H H H H H H H H H H H H H H H H H H
charge: 0
multiplicity: 1
keywords: wb97x-d3
keywords: def2-TZVPP
keywords: def2/J RIJCOSX
keywords: DEFGRID2
keywords: scfconv7
keywords: smallprint printgap noloewdin
keywords: NOSOSCF
formula: C22H19Cl2NO3
InChI: InChI=1/C22H19Cl2NO3/c1-22(2)17(12-19(23)24)20(22)21(26)28-18(13-25)14-7-6-10-16(11-14)27-15-8-4-3-5-9-15/h3-12,17-18,20H,1-2H3
47 atoms
Cl -4.447968 -3.750032 0.674511
Cl -3.461723 -6.433302 0.289145
O  1.215469 -1.150235 -0.760546
O  -0.704592 -0.301532 0.004933
O  1.387841 4.635512 0.553628
N  3.46532 -0.368666 -3.034684
C  -0.329066 -2.671183 2.065761
C  -1.414712 -2.99673 1.081465
C  -0.060344 -2.540808 0.57868
C  -0.512257 -1.444243 2.924341
C  0.414092 -3.776801 2.774281
C  -1.825737 -4.37832 0.804775
C  0.068964 -1.223348 -0.061809
C  -3.074632 -4.786599 0.618547
C  1.516621 0.105025 -1.357806
C  1.970546 1.131009 -0.345082
C  2.603959 -0.179177 -2.296503
C  1.439715 2.410795 -0.39452
C  2.919704 0.78789 0.610501
C  1.88866 3.364705 0.511642
C  3.336752 1.744547 1.521831
C  2.833963 3.03594 1.472119
C  1.004018 5.28005 -0.59741
C  -0.13557 6.067018 -0.522996
C  1.748038 5.212535 -1.768575
C  -0.534757 6.794437 -1.635554
C  1.327895 5.934117 -2.877075
C  0.188521 6.72579 -2.817805
H  -2.198439 -2.250569 1.017048
H  0.585426 -3.307274 0.165671
H  -1.154195 -0.690976 2.47281
H  0.450441 -0.982047 3.150744
H  -0.970585 -1.734876 3.871837
H  0.630401 -4.630118 2.13318
H  -0.16252 -4.13408 3.629307
H  1.367314 -3.402524 3.150806
H  -1.051349 -5.133278 0.737411
H  0.668291 0.484546 -1.937888
H  0.68571 2.652578 -1.133436
H  3.335075 -0.21104 0.646483
H  4.073173 1.489022 2.271278
H  3.169083 3.785736 2.177291
H  -0.699737 6.114636 0.399206
H  2.646088 4.610768 -1.824164
H  -1.421445 7.411443 -1.57622
H  1.903295 5.879342 -3.791692
H  -0.130615 7.287705 -3.685224
elementType: Cl O N C H
totalener: -2050.67289966 hartree
nucrepener: 2680.53684631 hartree
electener: -4731.20974597 hartree
oneelecener: -8136.46413595 hartree
twoeener: 3405.25438997 hartree
cpcmener: -0.03739172 hartree
kineticenergy: 2044.45108917 hartree
xcener: -151.860941373736 hartree
chargesum: 0.0000000
charge: -0.056890 -0.061776 -0.281419 -0.461385 -0.336069 -0.101132 0.092021 0.032298 -0.071195 -0.266895 -0.266612 -0.203000 0.391402 0.038984 0.415886 0.019756 -0.220275 -0.195287 -0.235004 0.281925 -0.126323 -0.228610 0.300476 -0.258804 -0.205677 -0.119779 -0.140286 -0.193241 0.079247 0.101842 0.094392 0.099262 0.101156 0.094107 0.101992 0.098724 0.134417 0.144896 0.149203 0.150002 0.161972 0.151073 0.148633 0.160014 0.161474 0.162720 0.161783
qa: -0.0569 -0.0618 -0.2814 -0.4614 -0.3361 -0.1011 0.0920 0.0323 -0.0712 -0.2669 -0.2666 -0.2030 0.3914 0.0390 0.4159 0.0198 -0.2203 -0.1953 -0.2350 0.2819 -0.1263 -0.2286 0.3005 -0.2588 -0.2057 -0.1198 -0.1403 -0.1932 0.0792 0.1018 0.0944 0.0993 0.1012 0.0941 0.1020 0.0987 0.1344 0.1449 0.1492 0.1500 0.1620 0.1511 0.1486 0.1600 0.1615 0.1627 0.1618
va: 1.2684 1.2429 2.1281 2.0493 2.0726 3.1093 3.7379 3.8807 3.8355 3.9049 3.9060 3.8961 4.1923 4.2079 3.7115 3.5907 4.0855 3.9657 3.9602 3.7229 3.9090 4.0055 3.6668 4.0116 3.9163 3.8737 3.8808 3.9035 1.0477 1.0320 1.0171 1.0004 1.0004 1.0050 1.0008 1.0013 1.0167 1.0172 1.0058 1.0116 0.9883 1.0044 1.0077 0.9959 0.9879 0.9890 0.9893
dispcorr: -0.023371228 hartree
energy: -2050.696270888567
dipole: 21.84748 -21.47854 0.36894 26.37023 -26.32187 0.04836 9.68619 -8.40583 1.28036
magnitude: 1.33334 au
magnitude: 3.38907 debye
