program: Orca
programVersion: 5.0.2
elementType: Cl Cl O O O N C C C C C C C C C C C C C C C C C C C C C C H H H H H H H H H H H H H H H H H H H
charge: 0
multiplicity: 1
keywords: wb97x-d3
keywords: def2-TZVPP
keywords: def2/J RIJCOSX
keywords: DEFGRID2
keywords: scfconv7
keywords: smallprint printgap noloewdin
keywords: NOSOSCF
formula: C22H19Cl2NO3
InChI: InChI=1/C22H19Cl2NO3/c1-22(2)17(12-19(23)24)20(22)21(26)28-18(13-25)14-7-6-10-16(11-14)27-15-8-4-3-5-9-15/h3-12,17-18,20H,1-2H3
47 atoms
Cl -2.490225 -0.145162 2.527754
Cl -4.70387 -0.426425 0.698904
O  1.95403 -1.345027 -1.25924
O  1.861889 -1.686231 0.944468
O  0.954665 3.563666 -0.29316
N  5.00041 -2.380359 -0.19594
C  -0.536534 -3.550555 0.173396
C  -1.055545 -2.240445 0.677785
C  -0.014187 -2.260408 -0.433304
C  0.321682 -4.372164 1.104062
C  -1.384892 -4.398891 -0.743098
C  -2.410011 -1.766219 0.372898
C  1.330863 -1.750863 -0.135713
C  -3.099306 -0.902758 1.107502
C  3.211375 -0.7014 -1.10274
C  3.102134 0.586944 -0.314585
C  4.196915 -1.642151 -0.560169
C  2.102254 1.472727 -0.701705
C  3.939408 0.892558 0.746845
C  1.911789 2.641999 0.018458
C  3.762691 2.088225 1.430549
C  2.744594 2.958523 1.085341
C  -0.200101 3.209049 -0.94815
C  -0.929254 2.07109 -0.6221
C  -0.655271 4.090142 -1.918277
C  -2.114711 1.816951 -1.296968
C  -1.851608 3.830623 -2.571189
C  -2.582303 2.690231 -2.269622
H  -0.663765 -1.943634 1.643866
H  -0.370472 -2.046649 -1.434042
H  0.816032 -3.782136 1.871559
H  1.084074 -4.920061 0.548232
H  -0.305075 -5.106273 1.61266
H  -2.130709 -4.951081 -0.169098
H  -0.757828 -5.127632 -1.258563
H  -1.904072 -3.82115 -1.506519
H  -2.898691 -2.147946 -0.515169
H  3.530149 -0.478495 -2.124402
H  1.471527 1.241466 -1.550729
H  4.72135 0.212108 1.057174
H  4.414305 2.33237 2.258547
H  2.593944 3.878894 1.634683
H  -0.587867 1.384532 0.143328
H  -0.079434 4.975894 -2.154482
H  -2.679827 0.927448 -1.053734
H  -2.205947 4.521827 -3.324438
H  -3.510396 2.483639 -2.785416
elementType: Cl O N C H
totalener: -2050.67167128 hartree
nucrepener: 2902.85343927 hartree
electener: -4953.52511055 hartree
oneelecener: -8581.14094288 hartree
twoeener: 3627.61583233 hartree
cpcmener: -0.03876614 hartree
kineticenergy: 2044.45619512 hartree
xcener: -151.867628855490 hartree
chargesum: 0.0000000
charge: -0.058604 -0.063137 -0.291327 -0.462824 -0.332237 -0.092499 0.092284 0.037079 -0.061860 -0.272679 -0.280650 -0.202876 0.413434 0.037802 0.517335 -0.035859 -0.253395 -0.283266 -0.206869 0.324803 -0.101809 -0.260704 0.323250 -0.228040 -0.269303 -0.099262 -0.107603 -0.214033 0.083185 0.103176 0.094614 0.103090 0.100013 0.105105 0.100122 0.095819 0.135217 0.149621 0.147948 0.134437 0.162422 0.149662 0.147824 0.146896 0.154135 0.160721 0.158843
qa: -0.0586 -0.0631 -0.2913 -0.4628 -0.3322 -0.0925 0.0923 0.0371 -0.0619 -0.2727 -0.2806 -0.2029 0.4134 0.0378 0.5173 -0.0359 -0.2534 -0.2833 -0.2069 0.3248 -0.1018 -0.2607 0.3232 -0.2280 -0.2693 -0.0993 -0.1076 -0.2140 0.0832 0.1032 0.0946 0.1031 0.1000 0.1051 0.1001 0.0958 0.1352 0.1496 0.1479 0.1344 0.1624 0.1497 0.1478 0.1469 0.1541 0.1607 0.1588
va: 1.2628 1.2402 2.1304 2.0420 2.0878 3.1036 3.7879 3.8341 3.8205 3.9023 3.9115 3.8689 4.1313 4.1966 3.8008 3.7349 4.0959 3.9660 3.9250 3.6999 3.9074 4.0146 3.6981 3.9412 4.0175 3.8031 3.8684 3.9695 1.0480 1.0317 1.0179 0.9992 0.9999 0.9991 1.0009 1.0048 1.0188 0.9895 1.0114 1.0170 0.9880 1.0058 1.0029 1.0084 1.0041 0.9873 0.9925
dispcorr: -0.027622706 hartree
energy: -2050.699293985501
dipole: 9.91359 -11.39343 -1.47984 -10.82784 10.75830 -0.06954 -11.44143 9.46437 -1.97705
magnitude: 2.47052 au
magnitude: 6.27957 debye
