program: Orca
programVersion: 5.0.2
elementType: Cl Cl O O O N C C C C C C C C C C C C C C C C C C C C C C H H H H H H H H H H H H H H H H H H H
charge: 0
multiplicity: 1
keywords: wb97x-d3
keywords: def2-TZVPP
keywords: def2/J RIJCOSX
keywords: DEFGRID2
keywords: scfconv7
keywords: smallprint printgap noloewdin
keywords: NOSOSCF
formula: C22H19Cl2NO3
InChI: InChI=1/C22H19Cl2NO3/c1-22(2)17(12-19(23)24)20(22)21(26)28-18(13-25)14-7-6-10-16(11-14)27-15-8-4-3-5-9-15/h3-12,17-18,20H,1-2H3
47 atoms
Cl -4.339704 -3.71577 -0.038494
Cl -3.291445 -6.399205 0.106426
O  1.476599 -1.164564 -0.514776
O  -0.533347 -0.243446 -0.186172
O  1.288788 4.58275 0.597659
N  4.036766 -0.629529 -2.52575
C  -0.623374 -2.406703 2.107255
C  -1.473834 -2.848926 0.952667
C  -0.040866 -2.415841 0.70544
C  -0.984363 -1.10906 2.786556
C  -0.049912 -3.42692 3.060461
C  -1.814309 -4.260414 0.739959
C  0.223995 -1.167713 -0.026429
C  -2.98847 -4.717741 0.325268
C  1.901751 0.026628 -1.168683
C  2.232563 1.126603 -0.187423
C  3.095225 -0.3578 -1.92363
C  1.587608 2.350381 -0.296922
C  3.164072 0.89758 0.818517
C  1.903161 3.363916 0.599961
C  3.453513 1.913302 1.715436
C  2.834487 3.148567 1.606992
C  0.786591 5.132622 -0.556272
C  1.499016 5.137208 -1.748876
C  -0.446045 5.761937 -0.461274
C  0.956711 5.776943 -2.854658
C  -0.968853 6.409363 -1.571506
C  -0.273854 6.415648 -2.772985
H  -2.224916 -2.129506 0.646693
H  0.675407 -3.207414 0.51831
H  -1.645261 -1.316811 3.629436
H  -1.500968 -0.407576 2.136123
H  -0.093449 -0.616664 3.179995
H  0.802728 -3.000819 3.591057
H  0.295494 -4.332556 2.5643
H  -0.794879 -3.713444 3.804405
H  -1.046023 -4.999348 0.932443
H  1.15667 0.369257 -1.893419
H  0.849462 2.500684 -1.074831
H  3.664761 -0.05887 0.903283
H  4.177158 1.748728 2.502236
H  3.067279 3.943727 2.303625
H  2.466316 4.656227 -1.821295
H  -0.985502 5.752207 0.477268
H  1.5088 5.780559 -3.78527
H  -1.927192 6.905763 -1.493775
H  -0.685399 6.917053 -3.638655
elementType: Cl O N C H
totalener: -2050.67309006 hartree
nucrepener: 2687.42542102 hartree
electener: -4738.09851108 hartree
oneelecener: -8150.28911489 hartree
twoeener: 3412.19060381 hartree
cpcmener: -0.03670738 hartree
kineticenergy: 2044.44979366 hartree
xcener: -151.861038247366 hartree
chargesum: 0.0000000
charge: -0.056909 -0.061163 -0.281312 -0.466141 -0.333446 -0.102087 0.090174 0.030739 -0.077010 -0.266817 -0.266650 -0.198627 0.405137 0.037297 0.420989 0.001551 -0.218858 -0.191433 -0.234376 0.299310 -0.124743 -0.237991 0.304464 -0.213229 -0.258220 -0.137937 -0.119532 -0.191957 0.080938 0.100119 0.100323 0.094539 0.100380 0.099403 0.093351 0.101863 0.132515 0.139942 0.147056 0.150225 0.162032 0.150469 0.161245 0.148822 0.162715 0.161640 0.161197
qa: -0.0569 -0.0612 -0.2813 -0.4661 -0.3334 -0.1021 0.0902 0.0307 -0.0770 -0.2668 -0.2666 -0.1986 0.4051 0.0373 0.4210 0.0016 -0.2189 -0.1914 -0.2344 0.2993 -0.1247 -0.2380 0.3045 -0.2132 -0.2582 -0.1379 -0.1195 -0.1920 0.0809 0.1001 0.1003 0.0945 0.1004 0.0994 0.0934 0.1019 0.1325 0.1399 0.1471 0.1502 0.1620 0.1505 0.1612 0.1488 0.1627 0.1616 0.1612
va: 1.2687 1.2439 2.1345 2.0456 2.0769 3.1099 3.7378 3.8838 3.8484 3.9038 3.9075 3.8935 4.1761 4.2099 3.7173 3.6109 4.0797 3.9399 3.9753 3.7186 3.9094 4.0089 3.6588 3.9266 4.0154 3.8768 3.8730 3.9040 1.0464 1.0327 1.0004 1.0177 0.9997 1.0010 1.0055 1.0009 1.0177 1.0176 1.0108 1.0094 0.9884 1.0051 0.9955 1.0076 0.9888 0.9880 0.9896
dispcorr: -0.023189444 hartree
energy: -2050.696279500993
dipole: 17.67412 -17.64927 0.02485 27.65918 -27.37744 0.28174 12.49853 -11.08801 1.41052
magnitude: 1.43860 au
magnitude: 3.65662 debye
