program: Orca
programVersion: 5.0.2
elementType: Cl Cl O O O N C C C C C C C C C C C C C C C C C C C C C C H H H H H H H H H H H H H H H H H H H
charge: 0
multiplicity: 1
keywords: wb97x-d3
keywords: def2-TZVPP
keywords: def2/J RIJCOSX
keywords: DEFGRID2
keywords: scfconv7
keywords: smallprint printgap noloewdin
keywords: NOSOSCF
formula: C22H19Cl2NO3
InChI: InChI=1/C22H19Cl2NO3/c1-22(2)17(12-19(23)24)20(22)21(26)28-18(13-25)14-7-6-10-16(11-14)27-15-8-4-3-5-9-15/h3-12,17-18,20H,1-2H3
47 atoms
Cl -4.055817 -4.020558 -0.508375
Cl -2.843103 -6.595681 -0.049173
O  1.393325 -1.030204 -0.287927
O  -0.670024 -0.195578 -0.074915
O  1.257657 4.734611 0.612288
N  3.799927 -0.598945 -2.514399
C  -0.899931 -2.317392 2.214858
C  -1.521801 -2.876301 0.970407
C  -0.113028 -2.306676 0.918717
C  -1.479929 -1.043516 2.779041
C  -0.382739 -3.249289 3.284239
C  -1.691957 -4.318155 0.759355
C  0.124387 -1.072996 0.154433
C  -2.721958 -4.888846 0.147492
C  1.779096 0.125842 -1.024825
C  2.179932 1.262841 -0.116604
C  2.910936 -0.300839 -1.848688
C  1.511375 2.474515 -0.212049
C  3.200205 1.082614 0.811158
C  1.890029 3.523732 0.617532
C  3.551435 2.132685 1.643303
C  2.907147 3.356844 1.546351
C  0.727893 5.242277 -0.54988
C  1.435769 5.237241 -1.745497
C  -0.525888 5.829301 -0.466529
C  0.867556 5.8241 -2.866989
C  -1.075593 6.424424 -1.593388
C  -0.385763 6.419523 -2.79798
H  -2.278797 -2.242461 0.52266
H  0.693092 -3.029313 0.86847
H  -0.698416 -0.421922 3.219289
H  -2.186878 -1.293295 3.571538
H  -2.015274 -0.44856 2.043667
H  -1.205633 -3.608462 3.90432
H  0.314853 -2.718825 3.933936
H  0.140787 -4.115963 2.883711
H  -0.914672 -4.979852 1.122748
H  0.986396 0.44346 -1.70876
H  0.707267 2.591395 -0.928094
H  3.721612 0.136223 0.884218
H  4.344051 2.004951 2.368067
H  3.189288 4.17992 2.190409
H  2.419245 4.788076 -1.807258
H  -1.06198 5.826744 0.474165
H  1.415934 5.820172 -3.799922
H  -2.051716 6.886906 -1.526949
H  -0.819064 6.878711 -3.676409
elementType: Cl O N C H
totalener: -2050.67309655 hartree
nucrepener: 2679.35627972 hartree
electener: -4730.02937627 hartree
oneelecener: -8134.15379766 hartree
twoeener: 3404.12442138 hartree
cpcmener: -0.03627497 hartree
kineticenergy: 2044.44928234 hartree
xcener: -151.860152910685 hartree
chargesum: 0.0000000
charge: -0.057227 -0.060829 -0.284692 -0.471428 -0.336485 -0.101588 0.091752 0.026568 -0.078775 -0.271264 -0.269708 -0.198808 0.416762 0.040387 0.419709 0.002046 -0.218257 -0.172792 -0.227239 0.274234 -0.129279 -0.230375 0.283446 -0.194124 -0.249652 -0.142925 -0.124244 -0.187597 0.082857 0.099423 0.103534 0.099078 0.094213 0.101901 0.099545 0.093957 0.132957 0.138449 0.147202 0.150356 0.162661 0.151413 0.160114 0.149407 0.162727 0.161610 0.160978
qa: -0.0572 -0.0608 -0.2847 -0.4714 -0.3365 -0.1016 0.0918 0.0266 -0.0788 -0.2713 -0.2697 -0.1988 0.4168 0.0404 0.4197 0.0020 -0.2183 -0.1728 -0.2272 0.2742 -0.1293 -0.2304 0.2834 -0.1941 -0.2497 -0.1429 -0.1242 -0.1876 0.0829 0.0994 0.1035 0.0991 0.0942 0.1019 0.0995 0.0940 0.1330 0.1384 0.1472 0.1504 0.1627 0.1514 0.1601 0.1494 0.1627 0.1616 0.1610
va: 1.2684 1.2443 2.1343 2.0390 2.0699 3.1097 3.7232 3.8809 3.8583 3.9044 3.9132 3.9001 4.1550 4.2101 3.7161 3.6173 4.0804 3.9281 3.9780 3.7336 3.9133 4.0111 3.6779 3.9170 4.0103 3.8820 3.8768 3.8999 1.0453 1.0327 0.9985 1.0000 1.0179 1.0003 1.0007 1.0055 1.0177 1.0195 1.0107 1.0084 0.9884 1.0044 0.9955 1.0068 0.9889 0.9880 0.9895
dispcorr: -0.022873131 hartree
energy: -2050.695969682108
dipole: 13.98771 -14.02810 -0.04039 29.69927 -29.29299 0.40628 14.55485 -12.92906 1.62579
magnitude: 1.67627 au
magnitude: 4.26075 debye
