program: Orca
programVersion: 5.0.2
elementType: Cl Cl O O O N C C C C C C C C C C C C C C C C C C C C C C H H H H H H H H H H H H H H H H H H H
charge: 0
multiplicity: 1
keywords: wb97x-d3
keywords: def2-TZVPP
keywords: def2/J RIJCOSX
keywords: DEFGRID2
keywords: scfconv7
keywords: smallprint printgap noloewdin
keywords: NOSOSCF
formula: C22H19Cl2NO3
InChI: InChI=1/C22H19Cl2NO3/c1-22(2)17(12-19(23)24)20(22)21(26)28-18(13-25)14-7-6-10-16(11-14)27-15-8-4-3-5-9-15/h3-12,17-18,20H,1-2H3
47 atoms
Cl -4.115617 -3.992124 -0.436125
Cl -2.932556 -6.556764 0.14409
O  1.454379 -1.073869 -0.279886
O  -0.614846 -0.225258 -0.234858
O  1.347735 4.662646 0.565705
N  3.937872 -0.805546 -2.43903
C  -0.940915 -2.196343 2.186481
C  -1.548711 -2.809288 0.960016
C  -0.127165 -2.275144 0.908647
C  -1.506245 -0.88194 2.664516
C  -0.466942 -3.076733 3.317458
C  -1.745367 -4.257235 0.826924
C  0.16198 -1.087631 0.090915
C  -2.78871 -4.843649 0.254047
C  1.8959 0.043447 -1.04607
C  2.302161 1.196599 -0.161436
C  3.038828 -0.446021 -1.818426
C  1.611379 2.396938 -0.250964
C  3.345374 1.040023 0.744619
C  1.993929 3.459592 0.559589
C  3.70161 2.103523 1.557475
C  3.037192 3.316609 1.463731
C  0.741925 5.154038 -0.564994
C  -0.482936 5.78153 -0.393056
C  1.346924 5.103411 -1.814496
C  -1.107255 6.369007 -1.484046
C  0.702958 5.681894 -2.89903
C  -0.521802 6.316961 -2.741212
H  -2.284041 -2.18589 0.464256
H  0.662257 -3.017573 0.919442
H  -0.730183 -0.275177 3.134016
H  -2.274283 -1.074442 3.415727
H  -1.966386 -0.294375 1.873598
H  0.033109 -3.981954 2.97626
H  -1.307969 -3.372337 3.9469
H  0.240075 -2.530154 3.943189
H  -0.975861 -4.911088 1.219541
H  1.132739 0.360178 -1.762944
H  0.788714 2.494015 -0.948383
H  3.881977 0.101943 0.815295
H  4.51315 1.994709 2.264138
H  3.323128 4.150526 2.091924
H  -0.938437 5.816084 0.588235
H  2.309996 4.627211 -1.948371
H  -2.059998 6.863216 -1.347634
H  1.171507 5.640914 -3.873415
H  -1.013644 6.769975 -3.591443
elementType: Cl O N C H
totalener: -2050.67304512 hartree
nucrepener: 2681.17729376 hartree
electener: -4731.85033888 hartree
oneelecener: -8137.75012632 hartree
twoeener: 3405.89978745 hartree
cpcmener: -0.03589938 hartree
kineticenergy: 2044.45141263 hartree
xcener: -151.860843709567 hartree
chargesum: -0.0000000
charge: -0.057040 -0.061130 -0.283704 -0.471321 -0.334397 -0.102082 0.089774 0.031890 -0.086875 -0.270459 -0.265996 -0.199452 0.420811 0.039047 0.424859 -0.002129 -0.220431 -0.186043 -0.226041 0.293110 -0.128203 -0.235476 0.303246 -0.259478 -0.209252 -0.119035 -0.138885 -0.192104 0.081370 0.099830 0.102390 0.099703 0.094251 0.093739 0.101370 0.099274 0.133364 0.136874 0.147054 0.149652 0.162765 0.150887 0.148877 0.160258 0.161615 0.162859 0.160666
qa: -0.0570 -0.0611 -0.2837 -0.4713 -0.3344 -0.1021 0.0898 0.0319 -0.0869 -0.2705 -0.2660 -0.1995 0.4208 0.0390 0.4249 -0.0021 -0.2204 -0.1860 -0.2260 0.2931 -0.1282 -0.2355 0.3032 -0.2595 -0.2093 -0.1190 -0.1389 -0.1921 0.0814 0.0998 0.1024 0.0997 0.0943 0.0937 0.1014 0.0993 0.1334 0.1369 0.1471 0.1497 0.1628 0.1509 0.1489 0.1603 0.1616 0.1629 0.1607
va: 1.2686 1.2438 2.1351 2.0380 2.0757 3.1091 3.7302 3.8758 3.8603 3.9047 3.9091 3.8969 4.1565 4.2098 3.7107 3.6294 4.0786 3.9299 3.9844 3.7239 3.9131 4.0134 3.6609 4.0146 3.9223 3.8733 3.8781 3.9049 1.0462 1.0328 0.9989 1.0000 1.0182 1.0054 1.0007 1.0010 1.0174 1.0199 1.0128 1.0078 0.9886 1.0050 1.0076 0.9955 0.9879 0.9888 0.9898
dispcorr: -0.022831050 hartree
energy: -2050.695876170425
dipole: 13.86245 -13.94518 -0.08273 30.34666 -29.79087 0.55578 13.72139 -12.09681 1.62459
magnitude: 1.71902 au
magnitude: 4.36940 debye
