program: Orca
programVersion: 5.0.2
elementType: Cl Cl O O O N C C C C C C C C C C C C C C C C C C C C C C H H H H H H H H H H H H H H H H H H H
charge: 0
multiplicity: 1
keywords: wb97x-d3
keywords: def2-TZVPP
keywords: def2/J RIJCOSX
keywords: DEFGRID2
keywords: scfconv7
keywords: smallprint printgap noloewdin
keywords: NOSOSCF
formula: C22H19Cl2NO3
InChI: InChI=1/C22H19Cl2NO3/c1-22(2)17(12-19(23)24)20(22)21(26)28-18(13-25)14-7-6-10-16(11-14)27-15-8-4-3-5-9-15/h3-12,17-18,20H,1-2H3
47 atoms
Cl -3.696148 -4.414131 -1.094834
Cl -2.906392 -6.7800 0.353678
O  1.836874 -1.395133 0.304204
O  -0.015301 -0.838377 -0.816206
O  1.588506 4.176812 -1.534382
N  5.088385 -1.004593 -0.062085
C  -1.286597 -2.06089 1.829749
C  -1.510026 -2.960116 0.647454
C  -0.114229 -2.458144 0.952059
C  -1.849487 -0.662869 1.762356
C  -1.29052 -2.634469 3.225569
C  -1.777135 -4.395119 0.802719
C  0.521418 -1.488032 0.045807
C  -2.669999 -5.09059 0.110443
C  2.567459 -0.435005 -0.4489
C  2.293472 0.980527 0.001618
C  3.974522 -0.770277 -0.224499
C  2.015859 1.951392 -0.946642
C  2.324593 1.299922 1.354176
C  1.790183 3.260343 -0.541117
C  2.085051 2.607994 1.743449
C  1.824191 3.597222 0.805585
C  0.782657 5.269745 -1.317834
C  -0.470179 5.150403 -0.729483
C  1.240734 6.495796 -1.776153
C  -1.263601 6.280953 -0.59826
C  0.430551 7.616012 -1.649237
C  -0.820162 7.515178 -1.056234
H  -1.99448 -2.480842 -0.19556
H  0.569388 -3.1689 1.402635
H  -1.218363 0.035046 2.315259
H  -2.838373 -0.648384 2.222716
H  -1.959837 -0.289209 0.746986
H  -2.314291 -2.747412 3.585974
H  -0.771324 -1.959919 3.907947
H  -0.801822 -3.605295 3.291253
H  -1.194784 -4.942545 1.534271
H  2.373447 -0.540926 -1.521404
H  1.981311 1.698113 -1.999399
H  2.538644 0.543791 2.098707
H  2.112367 2.869695 2.79255
H  1.65686 4.615545 1.131499
H  -0.830567 4.190614 -0.381132
H  2.218891 6.571161 -2.233896
H  -2.240072 6.191045 -0.140933
H  0.785703 8.572283 -2.010379
H  -1.447459 8.390657 -0.954927
elementType: Cl O N C H
totalener: -2050.67312999 hartree
nucrepener: 2668.41289312 hartree
electener: -4719.08602310 hartree
oneelecener: -8112.16422045 hartree
twoeener: 3393.07819734 hartree
cpcmener: -0.03762602 hartree
kineticenergy: 2044.44998948 hartree
xcener: -151.860502186597 hartree
chargesum: -0.0000000
charge: -0.057094 -0.061437 -0.280434 -0.460880 -0.336007 -0.100774 0.090576 0.035672 -0.076581 -0.264885 -0.264782 -0.204279 0.391470 0.038117 0.418186 0.024372 -0.220715 -0.239021 -0.231068 0.275667 -0.141755 -0.176648 0.277793 -0.189659 -0.245476 -0.148113 -0.127118 -0.182539 0.078190 0.102674 0.098763 0.101414 0.094219 0.101782 0.099233 0.093371 0.134745 0.144588 0.138948 0.150273 0.164055 0.159547 0.161533 0.148908 0.162908 0.160652 0.161609
qa: -0.0571 -0.0614 -0.2804 -0.4609 -0.3360 -0.1008 0.0906 0.0357 -0.0766 -0.2649 -0.2648 -0.2043 0.3915 0.0381 0.4182 0.0244 -0.2207 -0.2390 -0.2311 0.2757 -0.1418 -0.1766 0.2778 -0.1897 -0.2455 -0.1481 -0.1271 -0.1825 0.0782 0.1027 0.0988 0.1014 0.0942 0.1018 0.0992 0.0934 0.1347 0.1446 0.1389 0.1503 0.1641 0.1595 0.1615 0.1489 0.1629 0.1607 0.1616
va: 1.2683 1.2435 2.1291 2.0491 2.0651 3.1105 3.7410 3.8756 3.8371 3.9054 3.9050 3.8931 4.1984 4.2075 3.7044 3.6039 4.0868 4.0797 3.9595 3.7513 3.9137 3.9082 3.6769 3.9133 4.0060 3.8850 3.8795 3.8949 1.0483 1.0319 1.0004 1.0009 1.0165 1.0010 1.0013 1.0049 1.0163 1.0166 1.0178 1.0118 0.9894 0.9947 0.9951 1.0068 0.9892 0.9884 0.9892
dispcorr: -0.023314297 hartree
energy: -2050.696444284404
dipole: 5.99211 -7.21142 -1.21931 37.16535 -36.01440 1.15095 15.45422 -13.71478 1.73944
magnitude: 2.41601 au
magnitude: 6.14100 debye
