program: Orca
programVersion: 5.0.2
elementType: Cl Cl O O O N C C C C C C C C C C C C C C C C C C C C C C H H H H H H H H H H H H H H H H H H H
charge: 0
multiplicity: 1
keywords: wb97x-d3
keywords: def2-TZVPP
keywords: def2/J RIJCOSX
keywords: DEFGRID2
keywords: scfconv7
keywords: smallprint printgap noloewdin
keywords: NOSOSCF
formula: C22H19Cl2NO3
InChI: InChI=1/C22H19Cl2NO3/c1-22(2)17(12-19(23)24)20(22)21(26)28-18(13-25)14-7-6-10-16(11-14)27-15-8-4-3-5-9-15/h3-12,17-18,20H,1-2H3
47 atoms
Cl -3.589634 -4.6100 -1.122688
Cl -2.702029 -6.934266 0.334792
O  1.752284 -1.366238 0.269495
O  -0.153906 -0.799944 -0.752009
O  1.628732 4.269278 -1.512797
N  4.9825 -0.913683 -0.1851
C  -1.326232 -2.151885 1.869081
C  -1.526576 -3.044346 0.678221
C  -0.15066 -2.477256 0.966619
C  -1.96289 -0.784893 1.832381
C  -1.269115 -2.739982 3.257494
C  -1.715637 -4.493307 0.816374
C  0.4278 -1.470429 0.063189
C  -2.553073 -5.233817 0.101788
C  2.441422 -0.381699 -0.487187
C  2.163829 1.0255 -0.011186
C  3.860213 -0.694581 -0.308656
C  1.962786 2.023673 -0.950225
C  2.133579 1.315364 1.347834
C  1.74936 3.329759 -0.528627
C  1.904248 2.620961 1.752348
C  1.719073 3.637059 0.825272
C  0.865645 5.39589 -1.318272
C  -0.416135 5.331569 -0.786802
C  1.399447 6.601994 -1.746764
C  -1.162363 6.496699 -0.684234
C  0.636486 7.757428 -1.649221
C  -0.643431 7.711208 -1.114505
H  -2.04835 -2.578503 -0.149972
H  0.572598 -3.161922 1.394676
H  -2.111109 -0.40387 0.824862
H  -1.359774 -0.062322 2.384606
H  -2.94267 -0.829991 2.309554
H  -0.769826 -2.045998 3.935004
H  -0.727865 -3.683813 3.300812
H  -2.276242 -2.911006 3.640611
H  -1.118422 -5.012893 1.556204
H  2.218818 -0.474396 -1.555346
H  1.977519 1.793559 -2.008885
H  2.289974 0.539904 2.086466
H  1.881714 2.859559 2.807085
H  1.560585 4.652158 1.165194
H  -0.836132 4.387566 -0.463172
H  2.399499 6.633863 -2.160191
H  -2.161937 6.449444 -0.272786
H  1.051552 8.697465 -1.988149
H  -1.234178 8.613916 -1.036012
elementType: Cl O N C H
totalener: -2050.67296882 hartree
nucrepener: 2660.00301405 hartree
electener: -4710.67598287 hartree
oneelecener: -8095.33882176 hartree
twoeener: 3384.66283889 hartree
cpcmener: -0.03794196 hartree
kineticenergy: 2044.45199673 hartree
xcener: -151.861104889868 hartree
chargesum: -0.0000000
charge: -0.057092 -0.061350 -0.281850 -0.460438 -0.335237 -0.101489 0.091487 0.033135 -0.072765 -0.265683 -0.266793 -0.202046 0.391333 0.037831 0.417873 0.024771 -0.220814 -0.244214 -0.228967 0.282186 -0.141034 -0.181929 0.283987 -0.195138 -0.248056 -0.146719 -0.126023 -0.183557 0.078732 0.101281 0.094635 0.098743 0.101550 0.099330 0.093712 0.102196 0.134095 0.145824 0.138272 0.150387 0.163907 0.160023 0.161583 0.148765 0.162950 0.160977 0.161628
qa: -0.0571 -0.0613 -0.2819 -0.4604 -0.3352 -0.1015 0.0915 0.0331 -0.0728 -0.2657 -0.2668 -0.2020 0.3913 0.0378 0.4179 0.0248 -0.2208 -0.2442 -0.2290 0.2822 -0.1410 -0.1819 0.2840 -0.1951 -0.2481 -0.1467 -0.1260 -0.1836 0.0787 0.1013 0.0946 0.0987 0.1016 0.0993 0.0937 0.1022 0.1341 0.1458 0.1383 0.1504 0.1639 0.1600 0.1616 0.1488 0.1630 0.1610 0.1616
va: 1.2685 1.2435 2.1253 2.0488 2.0674 3.1106 3.7396 3.8821 3.8321 3.9045 3.9060 3.8938 4.1924 4.2085 3.7011 3.6139 4.0856 4.0875 3.9568 3.7453 3.9139 3.9092 3.6706 3.9180 4.0075 3.8841 3.8781 3.8959 1.0477 1.0326 1.0169 1.0004 1.0008 1.0013 1.0050 1.0008 1.0170 1.0167 1.0177 1.0120 0.9894 0.9946 0.9952 1.0070 0.9891 0.9882 0.9892
dispcorr: -0.023179650 hartree
energy: -2050.696148464820
dipole: 5.21081 -6.46092 -1.25010 37.79404 -36.67744 1.11660 15.80103 -14.03900 1.76203
magnitude: 2.43193 au
magnitude: 6.18148 debye
