program: Orca
programVersion: 5.0.2
elementType: Cl Cl O O O N C C C C C C C C C C C C C C C C C C C C C C H H H H H H H H H H H H H H H H H H H
charge: 0
multiplicity: 1
keywords: wb97x-d3
keywords: def2-TZVPP
keywords: def2/J RIJCOSX
keywords: DEFGRID2
keywords: scfconv7
keywords: smallprint printgap noloewdin
keywords: NOSOSCF
formula: C22H19Cl2NO3
InChI: InChI=1/C22H19Cl2NO3/c1-22(2)17(12-19(23)24)20(22)21(26)28-18(13-25)14-7-6-10-16(11-14)27-15-8-4-3-5-9-15/h3-12,17-18,20H,1-2H3
47 atoms
Cl -2.644831 0.125824 0.525453
Cl -4.459576 -0.718428 -1.550103
O  1.74564 -1.713544 0.275652
O  2.394854 -2.21457 -1.798756
O  0.695502 3.229833 -0.667346
N  3.185935 -0.780344 3.082693
C  -0.466118 -3.801423 -0.137985
C  -0.973374 -2.399721 -0.288317
C  0.22421 -2.861056 -1.108123
C  0.161242 -4.186264 1.179358
C  -1.215525 -4.944461 -0.779786
C  -2.221618 -2.072644 -0.98454
C  1.553862 -2.25399 -0.934285
C  -2.996132 -1.033864 -0.696561
C  2.953231 -1.005134 0.488889
C  2.938519 0.381559 -0.11526
C  3.076792 -0.898486 1.943711
C  1.768101 1.132547 -0.104951
C  4.118911 0.906056 -0.619442
C  1.802312 2.43321 -0.588191
C  4.133001 2.205649 -1.105277
C  2.982709 2.975598 -1.082905
C  -0.303259 3.199719 0.273051
C  -1.572522 3.535546 -0.179175
C  -0.078452 2.928297 1.616738
C  -2.625644 3.59438 0.719789
C  -1.147731 2.974753 2.501561
C  -2.421962 3.306204 2.062467
H  -0.728101 -1.747715 0.540829
H  0.026996 -3.080464 -2.151106
H  -0.606048 -4.614135 1.82672
H  0.603854 -3.349988 1.714687
H  0.930485 -4.94661 1.035443
H  -2.063554 -5.239835 -0.159717
H  -0.560149 -5.810612 -0.880678
H  -1.592652 -4.706086 -1.773472
H  -2.539546 -2.711984 -1.799324
H  3.819563 -1.568446 0.126987
H  0.845227 0.710446 0.274102
H  5.019886 0.30637 -0.631665
H  5.048361 2.625055 -1.500234
H  2.992198 3.992278 -1.454201
H  -1.730206 3.753008 -1.22808
H  0.910496 2.68674 1.984277
H  -3.612682 3.857553 0.362858
H  -0.973791 2.757403 3.547324
H  -3.247267 3.342995 2.760802
elementType: Cl O N C H
totalener: -2050.66986685 hartree
nucrepener: 2912.26238513 hartree
electener: -4962.93225198 hartree
oneelecener: -8600.03369694 hartree
twoeener: 3637.10144497 hartree
cpcmener: -0.03722615 hartree
kineticenergy: 2044.45669872 hartree
xcener: -151.866100018067 hartree
chargesum: 0.0000000
charge: -0.057827 -0.064560 -0.281647 -0.462543 -0.330985 -0.101606 0.095019 0.032600 -0.074224 -0.261181 -0.278325 -0.216923 0.412562 0.060027 0.385085 0.027635 -0.220890 -0.214447 -0.221579 0.309864 -0.104482 -0.250696 0.341822 -0.273793 -0.233179 -0.118722 -0.127463 -0.204551 0.086199 0.099339 0.097657 0.092297 0.101041 0.102879 0.099697 0.095036 0.132844 0.149685 0.135404 0.148784 0.161918 0.149801 0.145580 0.159288 0.157800 0.161443 0.158318
qa: -0.0578 -0.0646 -0.2816 -0.4625 -0.3310 -0.1016 0.0950 0.0326 -0.0742 -0.2612 -0.2783 -0.2169 0.4126 0.0600 0.3851 0.0276 -0.2209 -0.2144 -0.2216 0.3099 -0.1045 -0.2507 0.3418 -0.2738 -0.2332 -0.1187 -0.1275 -0.2046 0.0862 0.0993 0.0977 0.0923 0.1010 0.1029 0.0997 0.0950 0.1328 0.1497 0.1354 0.1488 0.1619 0.1498 0.1456 0.1593 0.1578 0.1614 0.1583
va: 1.2892 1.2420 2.1176 2.0422 2.0852 3.1028 3.7492 3.8362 3.8370 3.9092 3.9173 3.9002 4.1649 4.2026 3.7360 3.6276 4.0704 3.9849 3.9905 3.6905 3.8803 4.0009 3.6210 3.9837 3.9077 3.8503 3.8538 3.8676 1.0361 1.0275 0.9995 1.0097 1.0006 0.9999 1.0007 1.0053 1.0197 1.0173 1.0079 1.0011 0.9880 1.0056 1.0088 0.9971 0.9895 0.9890 0.9911
dispcorr: -0.027376580 hartree
energy: -2050.697243425098
dipole: 12.40895 -12.70412 -0.29517 -11.83905 10.72886 -1.11019 3.82504 -4.45098 -0.62594
magnitude: 1.30822 au
magnitude: 3.32524 debye
