program: Orca
programVersion: 5.0.2
elementType: Cl Cl O O O N C C C C C C C C C C C C C C C C C C C C C C H H H H H H H H H H H H H H H H H H H
charge: 0
multiplicity: 1
keywords: wb97x-d3
keywords: def2-TZVPP
keywords: def2/J RIJCOSX
keywords: DEFGRID2
keywords: scfconv7
keywords: smallprint printgap noloewdin
keywords: NOSOSCF
formula: C22H19Cl2NO3
InChI: InChI=1/C22H19Cl2NO3/c1-22(2)17(12-19(23)24)20(22)21(26)28-18(13-25)14-7-6-10-16(11-14)27-15-8-4-3-5-9-15/h3-12,17-18,20H,1-2H3
47 atoms
Cl -2.649074 0.203912 0.37834
Cl -4.555864 -0.819759 -1.524872
O  1.702787 -1.69429 0.295799
O  2.311047 -2.108201 -1.809339
O  0.70949 3.23735 -0.677734
N  3.175361 -0.825122 3.109173
C  -0.470927 -3.79751 -0.119506
C  -1.03055 -2.414922 -0.252214
C  0.173433 -2.826799 -1.091919
C  0.189305 -4.170387 1.18629
C  -1.179185 -4.965879 -0.76278
C  -2.301712 -2.134229 -0.92991
C  1.491208 -2.193847 -0.92811
C  -3.055312 -1.063498 -0.712057
C  2.921491 -1.007382 0.513766
C  2.930535 0.384863 -0.077275
C  3.049698 -0.918508 1.969871
C  1.765035 1.141337 -0.09381
C  4.125308 0.904296 -0.553321
C  1.815775 2.440459 -0.580079
C  4.155256 2.200808 -1.045229
C  3.007081 2.975539 -1.054021
C  -0.278919 3.222662 0.274569
C  -1.558887 3.527538 -0.167735
C  -0.031416 2.986833 1.621384
C  -2.600891 3.587812 0.744739
C  -1.088505 3.034676 2.519963
C  -2.374679 3.332199 2.090346
H  -0.798633 -1.757501 0.576917
H  -0.030895 -3.042027 -2.134325
H  1.019161 -4.859165 1.021289
H  -0.539021 -4.680225 1.818437
H  0.560391 -3.317503 1.748352
H  -2.018468 -5.291539 -0.146285
H  -0.492436 -5.807905 -0.859259
H  -1.558168 -4.743254 -1.759281
H  -2.661593 -2.845139 -1.66415
H  3.776695 -1.581527 0.142505
H  0.831175 0.725834 0.265243
H  5.024205 0.301249 -0.541534
H  5.080981 2.614465 -1.421602
H  3.028472 3.98902 -1.433297
H  -1.736009 3.714775 -1.219424
H  0.966558 2.769593 1.979658
H  -3.597782 3.822995 0.395689
H  -0.896418 2.844093 3.567747
H  -3.191734 3.367595 2.798394
elementType: Cl O N C H
totalener: -2050.66981630 hartree
nucrepener: 2910.59281535 hartree
electener: -4961.26263166 hartree
oneelecener: -8596.71299640 hartree
twoeener: 3635.45036475 hartree
cpcmener: -0.03743063 hartree
kineticenergy: 2044.45926056 hartree
xcener: -151.866580402725 hartree
chargesum: -0.0000000
charge: -0.056510 -0.064394 -0.281273 -0.463105 -0.333029 -0.100592 0.103287 0.013899 -0.068724 -0.263002 -0.285154 -0.204487 0.412880 0.055726 0.389319 0.026177 -0.222876 -0.207169 -0.221015 0.300158 -0.105948 -0.247311 0.334237 -0.267378 -0.224486 -0.132320 -0.131054 -0.194048 0.089559 0.099376 0.102817 0.097342 0.091996 0.104229 0.100067 0.095628 0.130941 0.149821 0.134373 0.148359 0.161948 0.150131 0.144666 0.158440 0.157056 0.162259 0.159184
qa: -0.0565 -0.0644 -0.2813 -0.4631 -0.3330 -0.1006 0.1033 0.0139 -0.0687 -0.2630 -0.2852 -0.2045 0.4129 0.0557 0.3893 0.0262 -0.2229 -0.2072 -0.2210 0.3002 -0.1059 -0.2473 0.3342 -0.2674 -0.2245 -0.1323 -0.1311 -0.1940 0.0896 0.0994 0.1028 0.0973 0.0920 0.1042 0.1001 0.0956 0.1309 0.1498 0.1344 0.1484 0.1619 0.1501 0.1447 0.1584 0.1571 0.1623 0.1592
va: 1.2934 1.2420 2.1173 2.0416 2.0816 3.1043 3.7459 3.8568 3.8289 3.9092 3.9210 3.8858 4.1624 4.2061 3.7298 3.6245 4.0715 3.9814 3.9910 3.6940 3.8804 4.0017 3.6262 3.9711 3.9034 3.8506 3.8651 3.8627 1.0334 1.0274 1.0000 0.9998 1.0098 0.9994 1.0003 1.0049 1.0210 1.0165 1.0092 1.0013 0.9879 1.0051 1.0094 0.9972 0.9910 0.9887 0.9903
dispcorr: -0.027349721 hartree
energy: -2050.697166023141
dipole: 12.96117 -13.23456 -0.27339 -11.91666 10.73813 -1.17853 4.40399 -4.95525 -0.55126
magnitude: 1.32950 au
magnitude: 3.37932 debye
