program: Orca
programVersion: 5.0.2
elementType: Cl Cl O O O N C C C C C C C C C C C C C C C C C C C C C C H H H H H H H H H H H H H H H H H H H
charge: 0
multiplicity: 1
keywords: wb97x-d3
keywords: def2-TZVPP
keywords: def2/J RIJCOSX
keywords: DEFGRID2
keywords: scfconv7
keywords: smallprint printgap noloewdin
keywords: NOSOSCF
formula: C22H19Cl2NO3
InChI: InChI=1/C22H19Cl2NO3/c1-22(2)17(12-19(23)24)20(22)21(26)28-18(13-25)14-7-6-10-16(11-14)27-15-8-4-3-5-9-15/h3-12,17-18,20H,1-2H3
47 atoms
Cl -1.965891 -3.666504 -1.607317
Cl -3.339955 -5.841446 -0.293894
O  1.369077 -1.260117 -0.218262
O  -0.504507 -0.037697 -0.190236
O  1.719748 4.577565 0.18013
N  4.276262 -1.238042 -1.772981
C  -1.049817 -1.942726 2.302161
C  -1.912144 -2.303735 1.142419
C  -0.426412 -2.158401 0.926202
C  -1.163707 -0.556916 2.885281
C  -0.710969 -2.999642 3.323388
C  -2.529205 -3.642176 1.011293
C  0.088162 -1.038783 0.127842
C  -2.603788 -4.294762 -0.139267
C  2.037606 -0.207592 -0.903257
C  2.316323 0.965866 0.005778
C  3.285194 -0.802389 -1.384021
C  1.889876 2.228428 -0.375005
C  2.957433 0.764594 1.222137
C  2.085488 3.298433 0.488558
C  3.161717 1.846324 2.063896
C  2.719776 3.111485 1.708783
C  0.611285 4.844748 -0.583939
C  -0.561983 4.104894 -0.499189
C  0.691915 5.953114 -1.415776
C  -1.652255 4.4796 -1.272728
C  -0.411002 6.322909 -2.171237
C  -1.585276 5.585305 -2.109431
H  -2.512114 -1.491273 0.739589
H  0.143397 -3.075564 0.831868
H  -0.210553 -0.230894 3.304641
H  -1.894639 -0.564551 3.695514
H  -1.489989 0.188297 2.163107
H  -1.496733 -3.068737 4.07782
H  0.21835 -2.746683 3.835917
H  -0.584398 -3.987045 2.878836
H  -2.962782 -4.106007 1.889733
H  1.470892 0.116219 -1.782314
H  1.401751 2.36283 -1.332114
H  3.293956 -0.221819 1.515555
H  3.660631 1.704704 3.01303
H  2.867963 3.952777 2.373437
H  -0.638052 3.244345 0.153317
H  1.610262 6.524093 -1.464932
H  -2.563787 3.899871 -1.212505
H  -0.345298 7.190154 -2.814914
H  -2.441072 5.870892 -2.706079
elementType: Cl O N C H
totalener: -2050.67016355 hartree
nucrepener: 2771.30009343 hartree
electener: -4821.97025699 hartree
oneelecener: -8318.17137537 hartree
twoeener: 3496.20111838 hartree
cpcmener: -0.03525795 hartree
kineticenergy: 2044.47104900 hartree
xcener: -151.864334623267 hartree
chargesum: -0.0000000
charge: -0.052672 -0.056715 -0.275860 -0.463190 -0.333401 -0.101432 0.134857 -0.030125 -0.135343 -0.266345 -0.281537 -0.211224 0.401176 0.070534 0.415140 0.024915 -0.218267 -0.228298 -0.243861 0.318321 -0.119645 -0.237657 0.320692 -0.219993 -0.266898 -0.141942 -0.116173 -0.195135 0.113911 0.115614 0.098842 0.101259 0.091033 0.103174 0.100508 0.095347 0.142385 0.141719 0.151658 0.148961 0.162508 0.150643 0.161119 0.147071 0.161719 0.161359 0.161248
qa: -0.0527 -0.0567 -0.2759 -0.4632 -0.3334 -0.1014 0.1349 -0.0301 -0.1353 -0.2663 -0.2815 -0.2112 0.4012 0.0705 0.4151 0.0249 -0.2183 -0.2283 -0.2439 0.3183 -0.1196 -0.2377 0.3207 -0.2200 -0.2669 -0.1419 -0.1162 -0.1951 0.1139 0.1156 0.0988 0.1013 0.0910 0.1032 0.1005 0.0953 0.1424 0.1417 0.1517 0.1490 0.1625 0.1506 0.1611 0.1471 0.1617 0.1614 0.1612
va: 1.2776 1.2496 2.1273 2.0419 2.0816 3.1101 3.7266 3.8792 3.8265 3.8949 3.9124 3.9043 4.1472 4.1847 3.7233 3.5744 4.0806 3.9510 3.9740 3.6908 3.8974 4.0121 3.6568 3.9124 4.0112 3.8859 3.8695 3.9089 1.0220 1.0235 1.0003 1.0023 1.0142 0.9994 1.0026 0.9989 1.0070 1.0169 1.0037 1.0108 0.9881 1.0050 0.9967 1.0087 0.9897 0.9877 0.9894
dispcorr: -0.025110171 hartree
energy: -2050.695273725995
dipole: 4.95217 -6.35510 -1.40294 27.52349 -27.19218 0.33131 20.52324 -18.57881 1.94442
magnitude: 2.42049 au
magnitude: 6.15240 debye
