program: Orca
programVersion: 5.0.2
elementType: Cl Cl O O O N C C C C C C C C C C C C C C C C C C C C C C H H H H H H H H H H H H H H H H H H H
charge: 0
multiplicity: 1
keywords: wb97x-d3
keywords: def2-TZVPP
keywords: def2/J RIJCOSX
keywords: DEFGRID2
keywords: scfconv7
keywords: smallprint printgap noloewdin
keywords: NOSOSCF
formula: C22H19Cl2NO3
InChI: InChI=1/C22H19Cl2NO3/c1-22(2)17(12-19(23)24)20(22)21(26)28-18(13-25)14-7-6-10-16(11-14)27-15-8-4-3-5-9-15/h3-12,17-18,20H,1-2H3
47 atoms
Cl -1.738079 -3.656726 -1.858174
Cl -3.041897 -5.970249 -0.723625
O  1.398555 -1.185333 -0.230182
O  -0.522842 -0.041899 -0.177993
O  1.565905 4.641291 0.459798
N  4.310315 -0.981128 -1.757542
C  -1.084131 -2.100908 2.174665
C  -1.870115 -2.447258 0.958411
C  -0.383961 -2.216164 0.823718
C  -1.294492 -0.753014 2.817021
C  -0.74036 -3.187904 3.162163
C  -2.406793 -3.807482 0.731381
C  0.103436 -1.034517 0.100494
C  -2.397303 -4.398757 -0.454288
C  2.030462 -0.075093 -0.856576
C  2.264014 1.0596 0.11279
C  3.302218 -0.597353 -1.358179
C  1.800813 2.326334 -0.207094
C  2.91121 0.818373 1.318591
C  1.967688 3.359225 0.70675
C  3.085769 1.863817 2.211108
C  2.609244 3.13206 1.916333
C  0.454852 4.910049 -0.300745
C  0.513448 6.044309 -1.09858
C  -0.702193 4.142377 -0.241545
C  -0.596378 6.412775 -1.845084
C  -1.799232 4.516423 -1.005471
C  -1.754671 5.648699 -1.80786
H  -2.491433 -1.647159 0.563585
H  0.236611 -3.097996 0.713636
H  -0.37335 -0.394467 3.279391
H  -2.044943 -0.840021 3.604384
H  -1.643622 0.00593 2.120411
H  -1.557419 -3.330881 3.871589
H  0.14863 -2.914791 3.73256
H  -0.542156 -4.145952 2.68101
H  -2.848824 -4.341438 1.564759
H  1.455464 0.272646 -1.72085
H  1.309154 2.492794 -1.157402
H  3.276487 -0.171114 1.563464
H  3.589183 1.691025 3.15266
H  2.735581 3.944555 2.62025
H  1.419348 6.636342 -1.128651
H  -0.759271 3.260275 0.383722
H  -0.548789 7.30038 -2.462157
H  -2.697866 3.915118 -0.965425
H  -2.615792 5.934234 -2.396907
elementType: Cl O N C H
totalener: -2050.67036468 hartree
nucrepener: 2768.87070723 hartree
electener: -4819.54107190 hartree
oneelecener: -8313.33447377 hartree
twoeener: 3493.79340187 hartree
cpcmener: -0.03528257 hartree
kineticenergy: 2044.46335496 hartree
xcener: -151.862833565978 hartree
chargesum: -0.0000000
charge: -0.052538 -0.056827 -0.276989 -0.464983 -0.333848 -0.101196 0.135537 -0.031671 -0.135572 -0.267724 -0.281461 -0.212164 0.405176 0.070887 0.414616 0.023133 -0.218181 -0.223582 -0.242460 0.314756 -0.120447 -0.237136 0.318978 -0.266088 -0.218533 -0.116420 -0.141080 -0.194971 0.114650 0.115063 0.100127 0.100493 0.091427 0.103330 0.100313 0.095121 0.143397 0.141791 0.150661 0.149264 0.162558 0.150368 0.147240 0.160428 0.161344 0.161843 0.161369
qa: -0.0525 -0.0568 -0.2770 -0.4650 -0.3338 -0.1012 0.1355 -0.0317 -0.1356 -0.2677 -0.2815 -0.2122 0.4052 0.0709 0.4146 0.0231 -0.2182 -0.2236 -0.2425 0.3148 -0.1204 -0.2371 0.3190 -0.2661 -0.2185 -0.1164 -0.1411 -0.1950 0.1147 0.1151 0.1001 0.1005 0.0914 0.1033 0.1003 0.0951 0.1434 0.1418 0.1507 0.1493 0.1626 0.1504 0.1472 0.1604 0.1613 0.1618 0.1614
va: 1.2781 1.2497 2.1272 2.0404 2.0805 3.1101 3.7234 3.8805 3.8323 3.8950 3.9136 3.9033 4.1390 4.1858 3.7231 3.5782 4.0807 3.9477 3.9752 3.6956 3.9002 4.0112 3.6560 4.0121 3.9128 3.8700 3.8841 3.9085 1.0217 1.0236 0.9997 1.0022 1.0146 0.9993 1.0026 0.9990 1.0067 1.0173 1.0043 1.0108 0.9881 1.0050 1.0086 0.9969 0.9878 0.9896 0.9894
dispcorr: -0.024982389 hartree
energy: -2050.695347064043
dipole: 2.83200 -4.31812 -1.48612 26.71162 -26.53170 0.17992 22.26651 -20.33221 1.93431
magnitude: 2.44591 au
magnitude: 6.21701 debye
