program: Orca
programVersion: 5.0.2
elementType: Cl Cl O O O N C C C C C C C C C C C C C C C C C C C C C C H H H H H H H H H H H H H H H H H H H
charge: 0
multiplicity: 1
keywords: wb97x-d3
keywords: def2-TZVPP
keywords: def2/J RIJCOSX
keywords: DEFGRID2
keywords: scfconv7
keywords: smallprint printgap noloewdin
keywords: NOSOSCF
formula: C22H19Cl2NO3
InChI: InChI=1/C22H19Cl2NO3/c1-22(2)17(12-19(23)24)20(22)21(26)28-18(13-25)14-7-6-10-16(11-14)27-15-8-4-3-5-9-15/h3-12,17-18,20H,1-2H3
47 atoms
Cl -0.4285 -5.044299 0.329734
Cl -3.132015 -5.927714 0.828583
O  1.478168 -1.043276 1.119183
O  1.068569 -1.413618 -1.045447
O  0.524757 3.812366 0.371144
N  4.078675 -0.239677 2.990587
C  -1.868268 -0.926546 0.129677
C  -1.673715 -2.314704 -0.381732
C  -0.66247 -1.749388 0.5787
C  -1.69457 0.236604 -0.81463
C  -2.903748 -0.680426 1.198171
C  -2.548736 -3.428457 0.047846
C  0.683109 -1.410231 0.096446
C  -2.097803 -4.633721 0.362817
C  2.737513 -0.495252 0.763137
C  2.610149 0.861762 0.105242
C  3.471105 -0.364542 2.022357
C  1.612723 1.736349 0.516731
C  3.493683 1.224126 -0.899541
C  1.50408 2.975071 -0.092598
C  3.384077 2.478202 -1.484742
C  2.393239 3.361561 -1.088284
C  -0.247764 4.513648 -0.521666
C  -0.670832 3.96875 -1.728306
C  -0.643547 5.787511 -0.139858
C  -1.488803 4.722761 -2.558267
C  -1.471111 6.523697 -0.975171
C  -1.892233 5.999059 -2.189597
H  -1.333194 -2.386931 -1.411808
H  -0.704748 -2.087502 1.607985
H  -0.989196 0.038814 -1.619359
H  -1.358629 1.125018 -0.27679
H  -2.653731 0.476558 -1.276639
H  -3.883283 -0.510147 0.747687
H  -2.648031 0.207035 1.778755
H  -2.994557 -1.515776 1.892819
H  -3.619446 -3.261958 0.081708
H  3.304322 -1.176364 0.119959
H  0.912808 1.467761 1.298649
H  4.261119 0.533911 -1.225445
H  4.075769 2.769988 -2.263305
H  2.315995 4.336606 -1.55212
H  -0.375866 2.969592 -2.024546
H  -0.308568 6.19608 0.805146
H  -1.816357 4.300899 -3.499375
H  -1.779348 7.516507 -0.674802
H  -2.53115 6.578261 -2.842565
elementType: Cl O N C H
totalener: -2050.67040954 hartree
nucrepener: 2789.39267807 hartree
electener: -4840.06308761 hartree
oneelecener: -8354.13022222 hartree
twoeener: 3514.06713461 hartree
cpcmener: -0.03660436 hartree
kineticenergy: 2044.46970554 hartree
xcener: -151.864309563299 hartree
chargesum: 0.0000000
charge: -0.052046 -0.057327 -0.283039 -0.451588 -0.341992 -0.100411 0.161040 -0.025763 -0.148717 -0.287550 -0.284328 -0.220096 0.390232 0.073249 0.424792 0.022748 -0.223401 -0.259687 -0.198364 0.242805 -0.128828 -0.165293 0.308307 -0.193026 -0.254723 -0.168452 -0.127193 -0.182727 0.111967 0.118991 0.100520 0.090849 0.108835 0.104045 0.101700 0.096216 0.142357 0.146994 0.144933 0.148555 0.163810 0.161509 0.159231 0.147877 0.161505 0.160640 0.160845
qa: -0.0520 -0.0573 -0.2830 -0.4516 -0.3420 -0.1004 0.1610 -0.0258 -0.1487 -0.2875 -0.2843 -0.2201 0.3902 0.0732 0.4248 0.0227 -0.2234 -0.2597 -0.1984 0.2428 -0.1288 -0.1653 0.3083 -0.1930 -0.2547 -0.1685 -0.1272 -0.1827 0.1120 0.1190 0.1005 0.0908 0.1088 0.1040 0.1017 0.0962 0.1424 0.1470 0.1449 0.1486 0.1638 0.1615 0.1592 0.1479 0.1615 0.1606 0.1608
va: 1.2770 1.2486 2.1142 2.0510 2.0455 3.1106 3.7129 3.8899 3.8221 3.8857 3.9111 3.9068 4.1740 4.1876 3.6909 3.6025 4.0833 4.0076 3.9892 3.7701 3.8884 3.9159 3.6312 3.8783 4.0112 3.9192 3.8847 3.8952 1.0227 1.0225 1.0126 1.0003 1.0034 0.9993 1.0032 0.9983 1.0076 1.0150 1.0225 1.0014 0.9887 0.9927 0.9942 1.0078 0.9902 0.9882 0.9890
dispcorr: -0.026630760 hartree
energy: -2050.697040297744
dipole: -6.24320 4.54594 -1.69727 40.68888 -39.48658 1.20230 -11.04214 9.36357 -1.67857
magnitude: 2.67280 au
magnitude: 6.79371 debye
