program: Orca
programVersion: 5.0.2
elementType: Cl Cl O O O N C C C C C C C C C C C C C C C C C C C C C C H H H H H H H H H H H H H H H H H H H
charge: 0
multiplicity: 1
keywords: wb97x-d3
keywords: def2-TZVPP
keywords: def2/J RIJCOSX
keywords: DEFGRID2
keywords: scfconv7
keywords: smallprint printgap noloewdin
keywords: NOSOSCF
formula: C22H19Cl2NO3
InChI: InChI=1/C22H19Cl2NO3/c1-22(2)17(12-19(23)24)20(22)21(26)28-18(13-25)14-7-6-10-16(11-14)27-15-8-4-3-5-9-15/h3-12,17-18,20H,1-2H3
47 atoms
Cl -0.085945 -5.177708 1.161295
Cl -2.732342 -6.299583 1.451359
O  1.217145 -0.914843 1.209783
O  1.257249 -1.758538 -0.859391
O  -0.307778 3.367973 -0.762512
N  3.295387 0.62409 3.253942
C  -1.879596 -1.495738 -0.333486
C  -1.446082 -2.919012 -0.433325
C  -0.70274 -2.000281 0.499728
C  -1.655791 -0.580106 -1.510753
C  -3.121442 -1.163509 0.455382
C  -2.267209 -4.014942 0.127341
C  0.66772 -1.582662 0.176849
C  -1.763831 -5.024994 0.820728
C  2.436302 -0.239528 0.942413
C  2.247713 0.930943 0.00132
C  2.901361 0.234991 2.246256
C  1.081171 1.681193 0.06344
C  3.244214 1.250649 -0.908335
C  0.90223 2.736295 -0.817927
C  3.059115 2.324585 -1.767753
C  1.888801 3.067037 -1.739692
C  -0.414935 4.708196 -1.042618
C  -1.520341 5.109188 -1.778617
C  0.494482 5.639448 -0.557477
C  -1.718787 6.459802 -2.028194
C  0.290109 6.985196 -0.826944
C  -0.813099 7.401969 -1.560733
H  -0.911195 -3.179978 -1.34326
H  -0.910265 -2.094331 1.559752
H  -0.795548 -0.856477 -2.115968
H  -1.522843 0.452934 -1.184838
H  -2.530779 -0.606252 -2.161665
H  -3.250789 -1.808158 1.324577
H  -4.00883 -1.263801 -0.171842
H  -3.082121 -0.132747 0.810048
H  -3.335778 -4.00718 -0.055451
H  3.198082 -0.922405 0.552219
H  0.298942 1.450144 0.7765
H  4.150857 0.661283 -0.955953
H  3.827016 2.576552 -2.486406
H  1.750744 3.883368 -2.436596
H  -2.222183 4.370673 -2.145059
H  1.350045 5.328081 0.028592
H  -2.583973 6.772653 -2.598064
H  0.997753 7.712157 -0.45116
H  -0.967419 8.453521 -1.762197
elementType: Cl O N C H
totalener: -2050.66994636 hartree
nucrepener: 2754.62844564 hartree
electener: -4805.29839200 hartree
oneelecener: -8284.89249250 hartree
twoeener: 3479.59410050 hartree
cpcmener: -0.03611473 hartree
kineticenergy: 2044.47034296 hartree
xcener: -151.864427952443 hartree
chargesum: 0.0000000
charge: -0.051675 -0.057425 -0.283891 -0.451188 -0.337659 -0.100006 0.143204 -0.017891 -0.147435 -0.275115 -0.282143 -0.221239 0.386762 0.073245 0.425627 0.043450 -0.226457 -0.294580 -0.211787 0.299994 -0.120906 -0.200135 0.280365 -0.249624 -0.193858 -0.129154 -0.152559 -0.181758 0.112934 0.118436 0.097203 0.092100 0.107426 0.095686 0.104007 0.100396 0.142845 0.148427 0.143402 0.149330 0.163565 0.161279 0.150455 0.160567 0.161941 0.162655 0.161183
qa: -0.0517 -0.0574 -0.2839 -0.4512 -0.3377 -0.1000 0.1432 -0.0179 -0.1474 -0.2751 -0.2821 -0.2212 0.3868 0.0732 0.4256 0.0435 -0.2265 -0.2946 -0.2118 0.3000 -0.1209 -0.2001 0.2804 -0.2496 -0.1939 -0.1292 -0.1526 -0.1818 0.1129 0.1184 0.0972 0.0921 0.1074 0.0957 0.1040 0.1004 0.1428 0.1484 0.1434 0.1493 0.1636 0.1613 0.1505 0.1606 0.1619 0.1627 0.1612
va: 1.2777 1.2487 2.1101 2.0518 2.0456 3.1111 3.7140 3.8836 3.8210 3.8873 3.9125 3.9058 4.1771 4.1894 3.6893 3.5822 4.0869 4.0398 4.0014 3.6950 3.8931 3.9401 3.6880 3.9999 3.9107 3.8834 3.8904 3.8935 1.0221 1.0227 1.0143 1.0048 1.0029 0.9986 0.9995 1.0035 1.0074 1.0137 1.0244 1.0014 0.9889 0.9937 1.0054 0.9961 0.9883 0.9893 0.9893
dispcorr: -0.025576743 hartree
energy: -2050.695523101811
dipole: -5.81533 4.54616 -1.26918 40.75734 -39.60862 1.14872 -17.28242 15.46399 -1.81843
magnitude: 2.49741 au
magnitude: 6.34790 debye
