program: Orca
programVersion: 5.0.2
elementType: Cl Cl O O O N C C C C C C C C C C C C C C C C C C C C C C H H H H H H H H H H H H H H H H H H H
charge: 0
multiplicity: 1
keywords: wb97x-d3
keywords: def2-TZVPP
keywords: def2/J RIJCOSX
keywords: DEFGRID2
keywords: scfconv7
keywords: smallprint printgap noloewdin
keywords: NOSOSCF
formula: C22H19Cl2NO3
InChI: InChI=1/C22H19Cl2NO3/c1-22(2)17(12-19(23)24)20(22)21(26)28-18(13-25)14-7-6-10-16(11-14)27-15-8-4-3-5-9-15/h3-12,17-18,20H,1-2H3
47 atoms
Cl -0.397256 -6.327197 2.290712
Cl -2.487566 -5.52693 4.109518
O  0.365893 -0.448763 0.100059
O  1.182559 -2.426417 -0.533737
O  1.604062 4.522366 -2.339975
N  3.514563 -0.653488 1.318456
C  -1.887924 -3.195328 -0.520724
C  -1.185949 -3.749407 0.682403
C  -1.045818 -2.27576 0.343971
C  -1.400745 -3.633436 -1.879241
C  -3.37652 -2.950673 -0.479509
C  -1.894288 -4.114595 1.914187
C  0.269886 -1.777924 -0.083458
C  -1.623963 -5.17728 2.661525
C  1.598119 0.158908 -0.269775
C  1.442529 1.651557 -0.145157
C  2.668096 -0.316004 0.616018
C  1.548092 2.431523 -1.285934
C  1.188443 2.238342 1.089622
C  1.419079 3.81039 -1.188194
C  1.057663 3.615037 1.170095
C  1.178788 4.411116 0.039569
C  0.87085 5.657712 -2.584745
C  -0.481491 5.747203 -2.280046
C  1.52762 6.702196 -3.218821
C  -1.170708 6.906888 -2.604668
C  0.821725 7.850367 -3.54855
C  -0.526535 7.961367 -3.238045
H  -0.311401 -4.34717 0.452833
H  -1.611263 -1.582769 0.956181
H  -0.358133 -3.941938 -1.885903
H  -1.52571 -2.834215 -2.611326
H  -1.99313 -4.485136 -2.216619
H  -3.917601 -3.879623 -0.667251
H  -3.660414 -2.239452 -1.2564
H  -3.719058 -2.547787 0.472429
H  -2.69219 -3.465917 2.255477
H  1.871761 -0.104226 -1.295314
H  1.739024 1.974755 -2.249545
H  1.103547 1.633368 1.983735
H  0.869691 4.082493 2.127175
H  1.092422 5.48644 0.125964
H  -0.999351 4.926968 -1.799609
H  2.580009 6.613597 -3.456381
H  -2.223255 6.979476 -2.364614
H  1.334613 8.663493 -4.044912
H  -1.072126 8.86072 -3.489956
elementType: Cl O N C H
totalener: -2050.67403495 hartree
nucrepener: 2608.17259632 hartree
electener: -4658.84663127 hartree
oneelecener: -7991.70441108 hartree
twoeener: 3332.85777981 hartree
cpcmener: -0.03987332 hartree
kineticenergy: 2044.46093648 hartree
xcener: -151.862294415375 hartree
chargesum: -0.0000000
charge: -0.057256 -0.060442 -0.280424 -0.466930 -0.336507 -0.102402 0.087037 0.030796 -0.077197 -0.266277 -0.263844 -0.203213 0.415085 0.041261 0.444656 0.000123 -0.235190 -0.215251 -0.218982 0.258440 -0.151730 -0.170770 0.295101 -0.198281 -0.256191 -0.146558 -0.122936 -0.189252 0.079018 0.101034 0.092891 0.103217 0.099513 0.101062 0.099450 0.092925 0.134877 0.128957 0.141392 0.153540 0.164314 0.160911 0.159804 0.148604 0.162991 0.160889 0.161746
qa: -0.0573 -0.0604 -0.2804 -0.4669 -0.3365 -0.1024 0.0870 0.0308 -0.0772 -0.2663 -0.2638 -0.2032 0.4151 0.0413 0.4447 0.0001 -0.2352 -0.2153 -0.2190 0.2584 -0.1517 -0.1708 0.2951 -0.1983 -0.2562 -0.1466 -0.1229 -0.1893 0.0790 0.1010 0.0929 0.1032 0.0995 0.1011 0.0995 0.0929 0.1349 0.1290 0.1414 0.1535 0.1643 0.1609 0.1598 0.1486 0.1630 0.1609 0.1617
va: 1.2680 1.2447 2.1694 2.0358 2.0656 3.1093 3.7352 3.8646 3.8697 3.9045 3.9096 3.9030 4.1491 4.2095 3.6879 3.7327 4.0293 4.0435 3.9839 3.7702 3.9249 3.9184 3.6651 3.9060 4.0065 3.8844 3.8795 3.8996 1.0495 1.0304 1.0169 0.9990 1.0001 1.0009 1.0012 1.0051 1.0163 1.0217 1.0156 1.0073 0.9901 0.9936 0.9960 1.0075 0.9891 0.9882 0.9892
dispcorr: -0.021920527 hartree
energy: -2050.695955474505
dipole: -8.56582 5.66797 -2.89786 34.47660 -32.12309 2.35351 -26.56202 25.30093 -1.26108
magnitude: 3.94042 au
magnitude: 10.01576 debye
