program: Orca
programVersion: 5.0.2
elementType: Cl Cl O O O N C C C C C C C C C C C C C C C C C C C C C C H H H H H H H H H H H H H H H H H H H
charge: 0
multiplicity: 1
keywords: wb97x-d3
keywords: def2-TZVPP
keywords: def2/J RIJCOSX
keywords: DEFGRID2
keywords: scfconv7
keywords: smallprint printgap noloewdin
keywords: NOSOSCF
formula: C22H19Cl2NO3
InChI: InChI=1/C22H19Cl2NO3/c1-22(2)17(12-19(23)24)20(22)21(26)28-18(13-25)14-7-6-10-16(11-14)27-15-8-4-3-5-9-15/h3-12,17-18,20H,1-2H3
47 atoms
Cl -3.636599 -3.933475 -1.164338
Cl -3.375339 -5.800578 1.017505
O  1.844149 -1.007193 0.384321
O  0.232573 -0.471269 -1.07806
O  1.840908 4.48827 -0.642915
N  5.024896 -1.690819 -0.237442
C  -1.58984 -0.93969 1.428618
C  -1.674955 -2.128937 0.517927
C  -0.316089 -1.615993 0.953483
C  -2.006952 0.400634 0.873213
C  -1.904127 -1.087407 2.897312
C  -2.105801 -3.445142 1.003932
C  0.565872 -0.976097 -0.035073
C  -2.927576 -4.269498 0.367817
C  2.814087 -0.305564 -0.394443
C  2.982504 1.097702 0.131102
C  4.047754 -1.086279 -0.287809
C  2.346357 2.138068 -0.531714
C  3.702682 1.339495 1.296162
C  2.422774 3.422823 -0.009722
C  3.788559 2.630758 1.789332
C  3.142539 3.677069 1.146469
C  0.549815 4.384232 -1.100632
C  -0.43102 3.687537 -0.405509
C  0.24534 5.061761 -2.272327
C  -1.727705 3.674807 -0.900186
C  -1.057299 5.046256 -2.749327
C  -2.048265 4.351834 -2.069369
H  -1.944712 -1.891759 -0.504948
H  0.198433 -2.197763 1.709723
H  -1.941147 0.460003 -0.210438
H  -1.400087 1.202332 1.298614
H  -3.046153 0.593018 1.146723
H  -1.507073 -2.003078 3.333223
H  -2.983712 -1.078041 3.056401
H  -1.480455 -0.250474 3.454335
H  -1.724429 -3.781094 1.960832
H  2.536575 -0.288024 -1.451701
H  1.799736 1.946144 -1.446753
H  4.201055 0.531463 1.817361
H  4.353617 2.826288 2.690144
H  3.200688 4.684357 1.537819
H  -0.199987 3.163691 0.513853
H  1.020602 5.599937 -2.80224
H  -2.493067 3.13488 -0.357779
H  -1.294164 5.576804 -3.662162
H  -3.062084 4.339995 -2.445811
elementType: Cl O N C H
totalener: -2050.67300019 hartree
nucrepener: 2760.10911594 hartree
electener: -4810.78211613 hartree
oneelecener: -8295.17458148 hartree
twoeener: 3484.39246535 hartree
cpcmener: -0.03622284 hartree
kineticenergy: 2044.44872511 hartree
xcener: -151.860134727478 hartree
chargesum: 0.0000000
charge: -0.056973 -0.061191 -0.279442 -0.468079 -0.341094 -0.102397 0.118558 0.034277 -0.095330 -0.314495 -0.264725 -0.203268 0.424676 0.039512 0.412686 -0.005891 -0.216456 -0.153970 -0.204184 0.250010 -0.133557 -0.217414 0.291912 -0.203888 -0.255739 -0.151836 -0.120114 -0.196439 0.081046 0.100026 0.099134 0.108320 0.105652 0.093160 0.102200 0.099371 0.133072 0.135962 0.147502 0.143885 0.163281 0.151013 0.167140 0.147664 0.174705 0.161112 0.160605
qa: -0.0570 -0.0612 -0.2794 -0.4681 -0.3411 -0.1024 0.1186 0.0343 -0.0953 -0.3145 -0.2647 -0.2033 0.4247 0.0395 0.4127 -0.0059 -0.2165 -0.1540 -0.2042 0.2500 -0.1336 -0.2174 0.2919 -0.2039 -0.2557 -0.1518 -0.1201 -0.1964 0.0810 0.1000 0.0991 0.1083 0.1057 0.0932 0.1022 0.0994 0.1331 0.1360 0.1475 0.1439 0.1633 0.1510 0.1671 0.1477 0.1747 0.1611 0.1606
va: 1.2686 1.2440 2.1284 2.0392 2.0641 3.1078 3.7172 3.8738 3.8764 3.9087 3.9053 3.8940 4.1538 4.2089 3.7153 3.6780 4.0741 3.9118 3.9858 3.7449 3.9100 4.0257 3.6914 3.8939 4.0062 3.8716 3.8833 3.9259 1.0453 1.0333 1.0107 0.9929 1.0013 1.0058 1.0009 1.0009 1.0169 1.0220 1.0156 1.0081 0.9886 1.0035 0.9906 1.0078 0.9812 0.9872 0.9905
dispcorr: -0.025261608 hartree
energy: -2050.698261798639
dipole: 4.65003 -5.84162 -1.19159 34.16080 -32.80775 1.35305 9.23174 -7.68425 1.54749
magnitude: 2.37599 au
magnitude: 6.03930 debye
