program: Orca
programVersion: 5.0.2
elementType: Cl Cl O O O N C C C C C C C C C C C C C C C C C C C C C C H H H H H H H H H H H H H H H H H H H
charge: 0
multiplicity: 1
keywords: wb97x-d3
keywords: def2-TZVPP
keywords: def2/J RIJCOSX
keywords: DEFGRID2
keywords: scfconv7
keywords: smallprint printgap noloewdin
keywords: NOSOSCF
formula: C22H19Cl2NO3
InChI: InChI=1/C22H19Cl2NO3/c1-22(2)17(12-19(23)24)20(22)21(26)28-18(13-25)14-7-6-10-16(11-14)27-15-8-4-3-5-9-15/h3-12,17-18,20H,1-2H3
47 atoms
Cl -4.145767 -3.138284 -0.92604
Cl -3.615311 -5.745612 0.18423
O  1.875558 -1.268315 -0.105871
O  0.034385 -0.12745 -0.666767
O  1.999146 4.453277 -0.14915
N  4.903738 -1.607993 -1.365138
C  -1.081697 -1.533831 1.909879
C  -1.599939 -2.235889 0.68982
C  -0.109965 -1.989615 0.836514
C  -1.416557 -0.071455 2.076397
C  -0.993343 -2.267731 3.225638
C  -2.075571 -3.62424 0.732862
C  0.554284 -1.02747 -0.055501
C  -3.132759 -4.09538 0.084257
C  2.671341 -0.351203 -0.852994
C  2.920682 0.91186 -0.066762
C  3.915837 -1.067556 -1.131903
C  2.374126 2.102223 -0.518753
C  3.630655 0.865673 1.128482
C  2.516941 3.250599 0.248964
C  3.791974 2.026972 1.866087
C  3.22835 3.221041 1.4385
C  0.759506 4.494129 -0.741933
C  -0.292148 3.686172 -0.325038
C  0.581556 5.424461 -1.755452
C  -1.525901 3.811832 -0.947768
C  -0.661876 5.546779 -2.359195
C  -1.71819 4.73731 -1.965009
H  -2.099136 -1.588708 -0.022262
H  0.495563 -2.847536 1.105123
H  -0.598466 0.460994 2.56492
H  -2.297259 0.023645 2.713605
H  -1.640686 0.433375 1.139499
H  -0.285186 -1.764682 3.885675
H  -0.662395 -3.299956 3.121295
H  -1.964318 -2.272994 3.723463
H  -1.518561 -4.332093 1.334924
H  2.208779 -0.119596 -1.817543
H  1.832102 2.125637 -1.455939
H  4.057161 -0.064079 1.484479
H  4.348666 2.004051 2.793056
H  3.340196 4.123721 2.025271
H  -0.164099 2.96543 0.473225
H  1.409147 6.049375 -2.066043
H  -2.34369 3.179745 -0.627485
H  -0.798043 6.274556 -3.148187
H  -2.683848 4.827877 -2.443836
elementType: Cl O N C H
totalener: -2050.67290848 hartree
nucrepener: 2755.08990185 hartree
electener: -4805.76281033 hartree
oneelecener: -8285.41081439 hartree
twoeener: 3479.64800406 hartree
cpcmener: -0.03630486 hartree
kineticenergy: 2044.45667779 hartree
xcener: -151.861875377867 hartree
chargesum: 0.0000000
charge: -0.057635 -0.060446 -0.278362 -0.470586 -0.340059 -0.101597 0.098128 0.030874 -0.085276 -0.270396 -0.267256 -0.203757 0.416262 0.038455 0.420166 0.007271 -0.221585 -0.188535 -0.220618 0.276928 -0.129101 -0.224014 0.291893 -0.197949 -0.249300 -0.154421 -0.127651 -0.184875 0.082522 0.100103 0.103262 0.101721 0.088922 0.099877 0.093100 0.101655 0.134473 0.138683 0.149214 0.148013 0.162970 0.151030 0.162888 0.148816 0.163248 0.161362 0.161582
qa: -0.0576 -0.0604 -0.2784 -0.4706 -0.3401 -0.1016 0.0981 0.0309 -0.0853 -0.2704 -0.2673 -0.2038 0.4163 0.0385 0.4202 0.0073 -0.2216 -0.1885 -0.2206 0.2769 -0.1291 -0.2240 0.2919 -0.1979 -0.2493 -0.1544 -0.1277 -0.1849 0.0825 0.1001 0.1033 0.1017 0.0889 0.0999 0.0931 0.1017 0.1345 0.1387 0.1492 0.1480 0.1630 0.1510 0.1629 0.1488 0.1632 0.1614 0.1616
va: 1.2680 1.2447 2.1373 2.0363 2.0721 3.1097 3.7196 3.8785 3.8582 3.9147 3.9083 3.8969 4.1588 4.2097 3.7231 3.5910 4.0753 3.9233 3.9845 3.7209 3.9052 4.0191 3.6863 3.8904 4.0014 3.8920 3.8822 3.9029 1.0450 1.0328 0.9980 1.0016 1.0141 1.0008 1.0055 1.0008 1.0167 1.0170 1.0095 1.0080 0.9883 1.0037 0.9911 1.0072 0.9893 0.9878 0.9892
dispcorr: -0.024765517 hartree
energy: -2050.697673994751
dipole: 10.91964 -11.72202 -0.80238 27.51267 -26.96734 0.54533 14.95412 -13.24811 1.70601
magnitude: 1.96257 au
magnitude: 4.98846 debye
