program: Orca
programVersion: 5.0.2
elementType: Cl Cl O O O N C C C C C C C C C C C C C C C C C C C C C C H H H H H H H H H H H H H H H H H H H
charge: 0
multiplicity: 1
keywords: wb97x-d3
keywords: def2-TZVPP
keywords: def2/J RIJCOSX
keywords: DEFGRID2
keywords: scfconv7
keywords: smallprint printgap noloewdin
keywords: NOSOSCF
formula: C22H19Cl2NO3
InChI: InChI=1/C22H19Cl2NO3/c1-22(2)17(12-19(23)24)20(22)21(26)28-18(13-25)14-7-6-10-16(11-14)27-15-8-4-3-5-9-15/h3-12,17-18,20H,1-2H3
47 atoms
Cl -4.369961 -2.915321 -0.577977
Cl -3.786461 -5.699656 -0.100901
O  1.937771 -1.296375 -0.382813
O  0.033386 -0.166371 -0.698594
O  1.855941 4.453937 0.277941
N  4.992271 -1.200171 -1.643517
C  -0.775559 -1.932237 1.793775
C  -1.480587 -2.400246 0.552787
C  0.021837 -2.221978 0.53345
C  -1.013265 -0.51192 2.24417
C  -0.561275 -2.885092 2.944339
C  -2.022732 -3.760875 0.445644
C  0.611563 -1.122662 -0.246236
C  -3.226944 -4.072977 -0.015866
C  2.659861 -0.224262 -0.984809
C  2.816107 0.933639 -0.028797
C  3.961162 -0.788941 -1.343035
C  2.272039 2.16435 -0.360957
C  3.458574 0.745162 1.190292
C  2.352732 3.209063 0.551295
C  3.550786 1.803845 2.078538
C  2.991182 3.035385 1.769857
C  0.664721 4.591865 -0.391967
C  0.561724 5.668262 -1.261671
C  -0.415857 3.743644 -0.177518
C  -0.636031 5.899105 -1.922513
C  -1.603428 3.981235 -0.855173
C  -1.721441 5.055674 -1.727271
H  -2.039489 -1.628247 0.036114
H  0.621488 -3.124243 0.572753
H  -1.821698 -0.497745 2.97683
H  -1.297089 0.159543 1.436736
H  -0.123399 -0.106466 2.72922
H  0.240994 -2.520483 3.58742
H  -0.290765 -3.890212 2.624101
H  -1.465635 -2.956638 3.551015
H  -1.396387 -4.583489 0.770143
H  2.181899 0.103787 -1.912998
H  1.784117 2.297495 -1.318678
H  3.885433 -0.216103 1.448507
H  4.05193 1.669978 3.02764
H  3.051674 3.85865 2.470017
H  1.411206 6.322144 -1.414894
H  -0.344412 2.907323 0.507101
H  -0.715005 6.741046 -2.597994
H  -2.4444 3.31991 -0.690994
H  -2.65227 5.234919 -2.248286
elementType: Cl O N C H
totalener: -2050.67266135 hartree
nucrepener: 2749.85252414 hartree
electener: -4800.52518549 hartree
oneelecener: -8274.92473973 hartree
twoeener: 3474.39955424 hartree
cpcmener: -0.03630136 hartree
kineticenergy: 2044.44534869 hartree
xcener: -151.859633579569 hartree
chargesum: 0.0000000
charge: -0.057587 -0.060872 -0.277482 -0.464645 -0.338953 -0.101013 0.096999 0.033312 -0.083213 -0.265092 -0.262736 -0.205890 0.398332 0.038273 0.420096 0.015925 -0.221514 -0.198040 -0.230509 0.284254 -0.127169 -0.225569 0.298211 -0.253128 -0.199627 -0.124188 -0.153204 -0.187352 0.081769 0.102376 0.102018 0.089072 0.100231 0.099512 0.092366 0.101638 0.135584 0.139828 0.150531 0.149492 0.162756 0.151059 0.148239 0.161864 0.161102 0.161647 0.161298
qa: -0.0576 -0.0609 -0.2775 -0.4646 -0.3390 -0.1010 0.0970 0.0333 -0.0832 -0.2651 -0.2627 -0.2059 0.3983 0.0383 0.4201 0.0159 -0.2215 -0.1980 -0.2305 0.2843 -0.1272 -0.2256 0.2982 -0.2531 -0.1996 -0.1242 -0.1532 -0.1874 0.0818 0.1024 0.1020 0.0891 0.1002 0.0995 0.0924 0.1016 0.1356 0.1398 0.1505 0.1495 0.1628 0.1511 0.1482 0.1619 0.1611 0.1616 0.1613
va: 1.2680 1.2444 2.1364 2.0418 2.0723 3.1101 3.7304 3.8738 3.8535 3.9095 3.9039 3.8907 4.1846 4.2072 3.7186 3.5758 4.0773 3.9335 3.9775 3.7157 3.9050 4.0166 3.6768 4.0031 3.8965 3.8794 3.8956 3.9014 1.0458 1.0319 1.0017 1.0143 0.9992 1.0014 1.0053 1.0009 1.0154 1.0170 1.0074 1.0090 0.9884 1.0040 1.0076 0.9910 0.9880 0.9898 0.9892
dispcorr: -0.024719611 hartree
energy: -2050.697380962304
dipole: 13.71240 -14.37776 -0.66536 24.24872 -24.07421 0.17451 14.99904 -13.41673 1.58231
magnitude: 1.72536 au
magnitude: 4.38552 debye
