program: Orca
programVersion: 5.0.2
elementType: Cl Cl O O O N C C C C C C C C C C C C C C C C C C C C C C H H H H H H H H H H H H H H H H H H H
charge: 0
multiplicity: 1
keywords: wb97x-d3
keywords: def2-TZVPP
keywords: def2/J RIJCOSX
keywords: DEFGRID2
keywords: scfconv7
keywords: smallprint printgap noloewdin
keywords: NOSOSCF
formula: C22H19Cl2NO3
InChI: InChI=1/C22H19Cl2NO3/c1-22(2)17(12-19(23)24)20(22)21(26)28-18(13-25)14-7-6-10-16(11-14)27-15-8-4-3-5-9-15/h3-12,17-18,20H,1-2H3
47 atoms
Cl -1.496973 -5.653846 -0.35196
Cl -3.772254 -5.319421 1.387579
O  1.072545 -0.124019 1.409424
O  1.565031 -1.5796 -0.21298
O  1.703584 4.181006 -1.415322
N  2.757454 1.573636 3.691122
C  -1.499054 -1.190137 -0.839578
C  -1.261143 -2.516637 -0.179112
C  -0.713482 -1.25387 0.457939
C  -0.797151 -0.91956 -2.147529
C  -2.856968 -0.537918 -0.755449
C  -2.324766 -3.239688 0.527264
C  0.741688 -1.040983 0.483652
C  -2.496268 -4.555349 0.51885
C  2.443184 0.25886 1.45563
C  2.824117 1.132603 0.285211
C  2.596764 0.991391 2.712644
C  2.059786 2.261026 0.010275
C  3.909727 0.795522 -0.50679
C  2.383417 3.042918 -1.088001
C  4.235255 1.603026 -1.588393
C  3.472337 2.71794 -1.890203
C  0.385857 4.334969 -1.049704
C  0.02599 5.53658 -0.459804
C  -0.565363 3.358714 -1.318643
C  -1.305797 5.766677 -0.141513
C  -1.890047 3.597413 -0.983321
C  -2.266539 4.798723 -0.396326
H  -0.517512 -3.134529 -0.669186
H  -1.241712 -0.881905 1.328285
H  0.10755 -1.507409 -2.283221
H  -0.535446 0.13673 -2.234332
H  -1.46867 -1.160127 -2.9731
H  -3.318968 -0.633079 0.226344
H  -3.533502 -0.975279 -1.491861
H  -2.773483 0.52826 -0.973915
H  -3.025967 -2.66125 1.116904
H  3.099211 -0.61589 1.506737
H  1.224973 2.521874 0.649978
H  4.494318 -0.087701 -0.284056
H  5.08044 1.351688 -2.214763
H  3.717772 3.339795 -2.741605
H  0.779191 6.287339 -0.258016
H  -0.284157 2.423253 -1.787001
H  -1.587916 6.705892 0.315662
H  -2.632958 2.838125 -1.190067
H  -3.302436 4.978655 -0.141784
elementType: Cl O N C H
totalener: -2050.67319842 hartree
nucrepener: 2778.90577932 hartree
electener: -4829.57897775 hartree
oneelecener: -8332.68836830 hartree
twoeener: 3503.10939055 hartree
cpcmener: -0.03863783 hartree
kineticenergy: 2044.45903400 hartree
xcener: -151.863187181930 hartree
chargesum: 0.0000000
charge: -0.057189 -0.061091 -0.284271 -0.462213 -0.334992 -0.100109 0.083910 0.027568 -0.056531 -0.262080 -0.265177 -0.205844 0.388027 0.040072 0.427466 0.017130 -0.226572 -0.218252 -0.214826 0.276566 -0.106199 -0.247767 0.266413 -0.227431 -0.209505 -0.134850 -0.174467 -0.173148 0.080594 0.101538 0.097811 0.093754 0.102787 0.094856 0.103706 0.088280 0.133577 0.144489 0.146964 0.150288 0.162329 0.150318 0.148442 0.192235 0.161202 0.181425 0.160764
qa: -0.0572 -0.0611 -0.2843 -0.4622 -0.3350 -0.1001 0.0839 0.0276 -0.0565 -0.2621 -0.2652 -0.2058 0.3880 0.0401 0.4275 0.0171 -0.2266 -0.2183 -0.2148 0.2766 -0.1062 -0.2478 0.2664 -0.2274 -0.2095 -0.1348 -0.1745 -0.1731 0.0806 0.1015 0.0978 0.0938 0.1028 0.0949 0.1037 0.0883 0.1336 0.1445 0.1470 0.1503 0.1623 0.1503 0.1484 0.1922 0.1612 0.1814 0.1608
va: 1.2683 1.2438 2.1328 2.0467 2.0780 3.1111 3.7304 3.8917 3.8400 3.8948 3.9131 3.9030 4.1907 4.2094 3.7179 3.6013 4.0908 3.9390 3.9668 3.7397 3.8914 4.0071 3.7260 3.9950 3.9265 3.8851 3.8992 3.9106 1.0478 1.0316 1.0176 1.0024 1.0012 1.0057 1.0014 1.0075 1.0173 1.0152 1.0161 1.0031 0.9877 1.0051 1.0065 0.9654 0.9881 0.9784 0.9905
dispcorr: -0.025665158 hartree
energy: -2050.698863581374
dipole: 1.75692 -2.91939 -1.16247 33.32340 -32.82562 0.49777 -14.15922 12.82272 -1.33651
magnitude: 1.83994 au
magnitude: 4.67675 debye
