program: Orca
programVersion: 5.0.2
elementType: Cl Cl O O O N C C C C C C C C C C C C C C C C C C C C C C H H H H H H H H H H H H H H H H H H H
charge: 0
multiplicity: 1
keywords: wb97x-d3
keywords: def2-TZVPP
keywords: def2/J RIJCOSX
keywords: DEFGRID2
keywords: scfconv7
keywords: smallprint printgap noloewdin
keywords: NOSOSCF
formula: C22H19Cl2NO3
InChI: InChI=1/C22H19Cl2NO3/c1-22(2)17(12-19(23)24)20(22)21(26)28-18(13-25)14-7-6-10-16(11-14)27-15-8-4-3-5-9-15/h3-12,17-18,20H,1-2H3
47 atoms
Cl -3.870994 -0.888978 1.620438
Cl -4.875015 -0.614602 -1.070889
O  2.2954 -1.461907 -0.872541
O  1.563506 -1.086593 1.206248
O  1.285947 3.467293 -0.881174
N  4.719073 -2.12665 1.426457
C  -0.640266 -3.164839 0.282989
C  -1.205591 -1.775562 0.272226
C  0.100149 -2.050348 -0.437979
C  -0.125487 -3.711306 1.590457
C  -1.257498 -4.217232 -0.604464
C  -2.37783 -1.431008 -0.549188
C  1.348624 -1.484254 0.089342
C  -3.547481 -1.040593 -0.06264
C  3.548816 -0.889848 -0.562438
C  3.506775 0.612416 -0.349626
C  4.173524 -1.576555 0.576195
C  2.397034 1.343674 -0.741754
C  4.61296 1.259228 0.190995
C  2.374512 2.715274 -0.525433
C  4.590823 2.634669 0.357243
C  3.46563 3.371853 0.018557
C  0.024892 3.022564 -0.562446
C  -0.244376 2.309138 0.600348
C  -0.997454 3.366074 -1.435441
C  -1.553418 1.944654 0.880919
C  -2.302443 3.00079 -1.13594
C  -2.587152 2.287083 0.019629
H  -1.117473 -1.241734 1.212987
H  0.055495 -2.102899 -1.519859
H  0.199586 -2.938556 2.28324
H  0.708985 -4.394847 1.424919
H  -0.920228 -4.274865 2.081922
H  -1.548971 -3.831456 -1.580521
H  -2.146275 -4.637307 -0.130354
H  -0.552106 -5.03307 -0.768207
H  -2.286486 -1.500254 -1.62673
H  4.174617 -1.109691 -1.43204
H  1.54293 0.869861 -1.208421
H  5.492937 0.699807 0.483519
H  5.45275 3.137206 0.774773
H  3.435862 4.442213 0.175265
H  0.54584 2.042762 1.290472
H  -0.773471 3.920009 -2.338258
H  -1.760702 1.39184 1.787759
H  -3.09817 3.272954 -1.816778
H  -3.606386 2.00762 0.24983
elementType: Cl O N C H
totalener: -2050.67172733 hartree
nucrepener: 2924.28249731 hartree
electener: -4974.95422464 hartree
oneelecener: -8624.26924456 hartree
twoeener: 3649.31501992 hartree
cpcmener: -0.03862241 hartree
kineticenergy: 2044.45372115 hartree
xcener: -151.868807428719 hartree
chargesum: 0.0000000
charge: -0.055794 -0.058173 -0.288724 -0.452398 -0.340370 -0.100010 0.118943 -0.031123 -0.065000 -0.275539 -0.257354 -0.170030 0.377147 0.024824 0.499523 -0.014951 -0.241622 -0.231169 -0.225294 0.280071 -0.118439 -0.234133 0.310970 -0.212372 -0.264115 -0.138845 -0.112250 -0.170052 0.096500 0.102001 0.093799 0.104249 0.099347 0.092379 0.101156 0.100729 0.142060 0.155785 0.152769 0.142149 0.161900 0.150437 0.152227 0.147574 0.153976 0.159946 0.137297
qa: -0.0558 -0.0582 -0.2887 -0.4524 -0.3404 -0.1000 0.1189 -0.0311 -0.0650 -0.2755 -0.2574 -0.1700 0.3771 0.0248 0.4995 -0.0150 -0.2416 -0.2312 -0.2253 0.2801 -0.1184 -0.2341 0.3110 -0.2124 -0.2641 -0.1388 -0.1122 -0.1701 0.0965 0.1020 0.0938 0.1042 0.0993 0.0924 0.1012 0.1007 0.1421 0.1558 0.1528 0.1421 0.1619 0.1504 0.1522 0.1476 0.1540 0.1599 0.1373
va: 1.2693 1.2488 2.1392 2.0384 2.0721 3.1009 3.7872 3.8596 3.8744 3.9045 3.9024 3.8108 4.1485 4.2118 3.7568 3.7236 4.0942 3.9513 3.9798 3.7232 3.8973 4.0263 3.6514 3.9136 4.0284 3.8239 3.9174 3.8413 1.0267 1.0357 1.0174 0.9997 1.0009 1.0031 1.0014 1.0022 1.0094 0.9897 1.0084 1.0089 0.9888 1.0036 1.0050 1.0075 1.0007 0.9890 1.0131
dispcorr: -0.029548499 hartree
energy: -2050.701275829040
dipole: 15.33293 -15.66540 -0.33246 -6.70976 6.34209 -0.36768 -1.53468 -0.64639 -2.18107
magnitude: 2.23669 au
magnitude: 5.68521 debye
