program: Orca
programVersion: 5.0.2
elementType: Cl Cl O O O N C C C C C C C C C C C C C C C C C C C C C C H H H H H H H H H H H H H H H H H H H
charge: 0
multiplicity: 1
keywords: wb97x-d3
keywords: def2-TZVPP
keywords: def2/J RIJCOSX
keywords: DEFGRID2
keywords: scfconv7
keywords: smallprint printgap noloewdin
keywords: NOSOSCF
formula: C22H19Cl2NO3
InChI: InChI=1/C22H19Cl2NO3/c1-22(2)17(12-19(23)24)20(22)21(26)28-18(13-25)14-7-6-10-16(11-14)27-15-8-4-3-5-9-15/h3-12,17-18,20H,1-2H3
47 atoms
Cl -0.681595 -4.371309 1.242257
Cl -3.467606 -5.038347 1.615851
O  1.154681 -0.486483 0.961858
O  1.226239 -1.464093 -1.050366
O  1.502424 3.92621 -1.545648
N  3.327888 -0.034408 3.397486
C  -1.867819 -0.768406 -0.934318
C  -1.652654 -2.223319 -0.706174
C  -0.860204 -1.231565 0.113775
C  -1.390324 -0.159024 -2.228627
C  -3.104383 -0.107749 -0.377019
C  -2.652239 -3.072219 -0.020602
C  0.586369 -1.102735 -0.09515
C  -2.3161 -4.0333 0.82767
C  2.547587 -0.25394 0.91156
C  2.930174 1.002049 0.150617
C  2.967318 -0.129852 2.309731
C  1.964521 1.877376 -0.326797
C  4.28119 1.258488 -0.038641
C  2.369243 3.023333 -1.003464
C  4.666334 2.410137 -0.707353
C  3.718875 3.29689 -1.18971
C  0.152107 3.858212 -1.282938
C  -0.704545 3.656939 -2.353527
C  -0.338264 4.052529 0.001483
C  -2.075881 3.654329 -2.134463
C  -1.709699 4.033968 0.20901
C  -2.581509 3.836484 -0.855052
H  -1.079363 -2.735074 -1.47561
H  -1.180158 -1.08824 1.139314
H  -1.026751 0.857855 -2.070747
H  -2.222132 -0.104089 -2.932965
H  -0.599157 -0.733304 -2.70579
H  -3.940455 -0.219611 -1.06993
H  -2.93186 0.960827 -0.235949
H  -3.406457 -0.523789 0.584274
H  -3.704448 -2.920488 -0.232336
H  3.079618 -1.114247 0.490086
H  0.912295 1.67771 -0.176383
H  5.027565 0.568375 0.335074
H  5.716804 2.620446 -0.856204
H  4.020064 4.193514 -1.716007
H  -0.304146 3.509074 -3.348447
H  0.339438 4.218473 0.829665
H  -2.747828 3.499667 -2.968363
H  -2.097128 4.182852 1.208267
H  -3.649964 3.8277 -0.68634
elementType: Cl O N C H
totalener: -2050.67007065 hartree
nucrepener: 2852.58168860 hartree
electener: -4903.25175925 hartree
oneelecener: -8480.33998205 hartree
twoeener: 3577.08822279 hartree
cpcmener: -0.03584805 hartree
kineticenergy: 2044.44709144 hartree
xcener: -151.863187656264 hartree
chargesum: 0.0000000
charge: -0.052843 -0.055907 -0.286550 -0.457773 -0.332082 -0.099674 0.172600 -0.042721 -0.132994 -0.261039 -0.296668 -0.211505 0.393633 0.069144 0.404406 0.028244 -0.223174 -0.224630 -0.264620 0.346489 -0.094665 -0.264645 0.287740 -0.215349 -0.213766 -0.143204 -0.117907 -0.192823 0.116360 0.113340 0.065445 0.105477 0.103125 0.105389 0.092804 0.099688 0.143449 0.147902 0.132854 0.150413 0.161239 0.148600 0.149330 0.158785 0.160921 0.163794 0.163370
qa: -0.0528 -0.0559 -0.2866 -0.4578 -0.3321 -0.0997 0.1726 -0.0427 -0.1330 -0.2610 -0.2967 -0.2115 0.3936 0.0691 0.4044 0.0282 -0.2232 -0.2246 -0.2646 0.3465 -0.0947 -0.2646 0.2877 -0.2153 -0.2138 -0.1432 -0.1179 -0.1928 0.1164 0.1133 0.0654 0.1055 0.1031 0.1054 0.0928 0.0997 0.1434 0.1479 0.1329 0.1504 0.1612 0.1486 0.1493 0.1588 0.1609 0.1638 0.1634
va: 1.2780 1.2508 2.1034 2.0439 2.0839 3.1142 3.6535 3.9020 3.8320 3.8664 3.9190 3.9059 4.1305 4.1854 3.7001 3.6826 4.0596 3.9531 4.0088 3.6837 3.8841 4.0051 3.6321 3.9478 3.9381 3.8174 3.8301 3.8487 1.0205 1.0259 1.0167 1.0031 1.0213 0.9990 1.0096 1.0009 1.0068 1.0189 1.0188 1.0013 0.9878 1.0075 1.0056 0.9962 0.9892 0.9873 0.9892
dispcorr: -0.028059646 hartree
energy: -2050.698130298754
dipole: -3.94454 2.09972 -1.84482 32.30747 -31.45851 0.84896 -18.37883 16.82819 -1.55064
magnitude: 2.55511 au
magnitude: 6.49457 debye
