program: Orca
programVersion: 5.0.2
elementType: Cl Cl O O O N C C C C C C C C C C C C C C C C C C C C C C H H H H H H H H H H H H H H H H H H H
charge: 0
multiplicity: 1
keywords: wb97x-d3
keywords: def2-TZVPP
keywords: def2/J RIJCOSX
keywords: DEFGRID2
keywords: scfconv7
keywords: smallprint printgap noloewdin
keywords: NOSOSCF
formula: C22H19Cl2NO3
InChI: InChI=1/C22H19Cl2NO3/c1-22(2)17(12-19(23)24)20(22)21(26)28-18(13-25)14-7-6-10-16(11-14)27-15-8-4-3-5-9-15/h3-12,17-18,20H,1-2H3
47 atoms
Cl -4.466076 -2.745522 -0.192035
Cl -4.050112 -5.58771 0.070385
O  1.751505 -1.363367 -0.549394
O  -0.159378 -0.203977 -0.484292
O  2.071063 4.498365 0.0582
N  4.695067 -1.142231 -2.017898
C  -0.531216 -2.229781 1.955842
C  -1.501724 -2.500793 0.841077
C  -0.026506 -2.372834 0.531899
C  -0.583776 -0.871715 2.611147
C  -0.136898 -3.331061 2.908258
C  -2.140646 -3.810473 0.669395
C  0.461205 -1.200154 -0.210891
C  -3.381971 -4.009353 0.245356
C  2.392055 -0.250778 -1.161894
C  2.609845 0.884657 -0.188913
C  3.677297 -0.767848 -1.634502
C  2.21124 2.163529 -0.544159
C  3.196233 0.636583 1.046742
C  2.397139 3.204936 0.356375
C  3.380057 1.688239 1.930085
C  2.977567 2.972202 1.594685
C  0.957835 4.77868 -0.697057
C  -0.252918 4.127216 -0.497491
C  1.073342 5.794805 -1.634362
C  -1.352369 4.500736 -1.257419
C  -0.038339 6.16561 -2.377879
C  -1.252338 5.517612 -2.198047
H  -2.102133 -1.645653 0.552745
H  0.515637 -3.290559 0.333591
H  0.410128 -0.561308 2.939157
H  -1.222371 -0.920099 3.494399
H  -0.985737 -0.095142 1.963669
H  -0.894397 -3.455604 3.68381
H  0.802812 -3.077099 3.400955
H  0.00499 -4.292871 2.417398
H  -1.556782 -4.694049 0.897621
H  1.833815 0.096585 -2.037411
H  1.760601 2.337658 -1.513688
H  3.510025 -0.362748 1.320905
H  3.83554 1.508854 2.894525
H  3.115883 3.7916 2.288195
H  -0.347108 3.340076 0.240031
H  2.023587 6.293793 -1.775909
H  -2.296234 3.994307 -1.104771
H  0.05191 6.960798 -3.106173
H  -2.115354 5.804966 -2.783401
elementType: Cl O N C H
totalener: -2050.67264904 hartree
nucrepener: 2731.27566284 hartree
electener: -4781.94831188 hartree
oneelecener: -8237.86901619 hartree
twoeener: 3455.92070430 hartree
cpcmener: -0.03723054 hartree
kineticenergy: 2044.45963287 hartree
xcener: -151.862545123227 hartree
chargesum: -0.0000000
charge: -0.057738 -0.061768 -0.276143 -0.458169 -0.338267 -0.101046 0.095791 0.024048 -0.063331 -0.264062 -0.271063 -0.203087 0.382307 0.040566 0.413367 0.025433 -0.218311 -0.190269 -0.251286 0.278921 -0.120301 -0.224603 0.287202 -0.192906 -0.251834 -0.147986 -0.123808 -0.187829 0.078176 0.103607 0.097703 0.103211 0.093677 0.102439 0.099517 0.094105 0.133465 0.144157 0.148502 0.149334 0.162635 0.151113 0.160236 0.148798 0.162525 0.161245 0.161724
qa: -0.0577 -0.0618 -0.2761 -0.4582 -0.3383 -0.1010 0.0958 0.0240 -0.0633 -0.2641 -0.2711 -0.2031 0.3823 0.0406 0.4134 0.0254 -0.2183 -0.1903 -0.2513 0.2789 -0.1203 -0.2246 0.2872 -0.1929 -0.2518 -0.1480 -0.1238 -0.1878 0.0782 0.1036 0.0977 0.1032 0.0937 0.1024 0.0995 0.0941 0.1335 0.1442 0.1485 0.1493 0.1626 0.1511 0.1602 0.1488 0.1625 0.1612 0.1617
va: 1.2679 1.2430 2.1310 2.0486 2.0688 3.1097 3.7416 3.8875 3.8111 3.9061 3.9053 3.9002 4.2157 4.2092 3.7142 3.5733 4.0828 3.9429 3.9555 3.7198 3.8975 4.0076 3.6785 3.9068 4.0081 3.8904 3.8760 3.9008 1.0489 1.0306 1.0007 1.0012 1.0138 1.0005 1.0009 1.0052 1.0177 1.0166 1.0057 1.0113 0.9878 1.0040 0.9965 1.0072 0.9894 0.9880 0.9892
dispcorr: -0.024317344 hartree
energy: -2050.696966386733
dipole: 17.51346 -18.00905 -0.49559 22.20835 -22.19074 0.01761 13.60784 -12.12189 1.48596
magnitude: 1.56652 au
magnitude: 3.98178 debye
