program: Orca
programVersion: 5.0.2
elementType: Cl Cl O O O N C C C C C C C C C C C C C C C C C C C C C C H H H H H H H H H H H H H H H H H H H
charge: 0
multiplicity: 1
keywords: wb97x-d3
keywords: def2-TZVPP
keywords: def2/J RIJCOSX
keywords: DEFGRID2
keywords: scfconv7
keywords: smallprint printgap noloewdin
keywords: NOSOSCF
formula: C22H19Cl2NO3
InChI: InChI=1/C22H19Cl2NO3/c1-22(2)17(12-19(23)24)20(22)21(26)28-18(13-25)14-7-6-10-16(11-14)27-15-8-4-3-5-9-15/h3-12,17-18,20H,1-2H3
47 atoms
Cl -2.392172 -4.649308 -2.003557
Cl -3.463906 -5.912957 0.357522
O  1.835755 -1.052608 1.309383
O  1.303745 -1.417527 -0.829923
O  0.810414 3.82735 0.680381
N  4.485148 -0.159671 3.057094
C  -1.557174 -1.070653 0.578094
C  -1.353629 -2.442744 -0.004585
C  -0.298219 -1.854561 0.902656
C  -1.502189 0.109222 -0.361716
C  -2.52441 -0.870261 1.718399
C  -2.112708 -3.606043 0.470258
C  0.996831 -1.4449 0.334695
C  -2.586312 -4.581515 -0.294336
C  3.06018 -0.466951 0.888369
C  2.856642 0.875359 0.22202
C  3.843606 -0.306283 2.113888
C  1.919403 1.761263 0.737576
C  3.593262 1.204098 -0.905301
C  1.72115 2.979796 0.109395
C  3.394705 2.43613 -1.51294
C  2.460078 3.329987 -1.015688
C  -0.009327 4.579358 -0.128069
C  -0.204409 5.906855 0.221094
C  -0.666007 4.023461 -1.219195
C  -1.069169 6.6880 -0.532843
C  -1.518044 4.819982 -1.970363
C  -1.723264 6.151744 -1.633254
H  -1.096934 -2.448406 -1.057582
H  -0.248149 -2.233216 1.917409
H  -1.147871 1.000618 0.160646
H  -2.505155 0.323641 -0.734967
H  -0.862051 -0.054545 -1.226412
H  -2.499306 -1.678534 2.447691
H  -3.545121 -0.787908 1.341026
H  -2.291574 0.054373 2.248662
H  -2.299764 -3.688511 1.534332
H  3.616185 -1.138662 0.22589
H  1.335658 1.515065 1.616654
H  4.313002 0.503708 -1.308887
H  3.969887 2.70291 -2.389279
H  2.314293 4.287145 -1.499912
H  0.312444 6.32292 1.076523
H  -0.522396 2.982429 -1.482313
H  -1.222856 7.723627 -0.259568
H  -2.029697 4.390825 -2.821918
H  -2.391615 6.765337 -2.222091
elementType: Cl O N C H
totalener: -2050.67270013 hartree
nucrepener: 2747.12985511 hartree
electener: -4797.80255524 hartree
oneelecener: -8269.41832948 hartree
twoeener: 3471.61577424 hartree
cpcmener: -0.03790233 hartree
kineticenergy: 2044.45176863 hartree
xcener: -151.861260529021 hartree
chargesum: -0.0000000
charge: -0.057396 -0.061911 -0.279650 -0.449922 -0.341445 -0.100815 0.107241 0.025661 -0.067265 -0.280727 -0.268264 -0.202402 0.372662 0.038201 0.420933 0.017965 -0.221802 -0.256836 -0.194956 0.238909 -0.134832 -0.160184 0.276382 -0.238471 -0.174121 -0.131660 -0.172619 -0.175415 0.077397 0.104531 0.093173 0.108840 0.099859 0.094118 0.102661 0.099932 0.133536 0.147059 0.141546 0.149290 0.163919 0.160859 0.148273 0.164276 0.161169 0.161399 0.160898
qa: -0.0574 -0.0619 -0.2796 -0.4499 -0.3414 -0.1008 0.1072 0.0257 -0.0673 -0.2807 -0.2683 -0.2024 0.3727 0.0382 0.4209 0.0180 -0.2218 -0.2568 -0.1950 0.2389 -0.1348 -0.1602 0.2764 -0.2385 -0.1741 -0.1317 -0.1726 -0.1754 0.0774 0.1045 0.0932 0.1088 0.0999 0.0941 0.1027 0.0999 0.1335 0.1471 0.1415 0.1493 0.1639 0.1609 0.1483 0.1643 0.1612 0.1614 0.1609
va: 1.2683 1.2431 2.1231 2.0555 2.0471 3.1094 3.7434 3.8965 3.8175 3.9029 3.9025 3.8949 4.2258 4.2091 3.7013 3.6000 4.0862 4.0022 3.9781 3.7779 3.8996 3.9009 3.6650 4.0072 3.8786 3.8834 3.9246 3.8903 1.0491 1.0305 0.9993 1.0018 1.0127 1.0051 1.0007 1.0016 1.0171 1.0138 1.0250 1.0012 0.9890 0.9934 1.0070 0.9903 0.9880 0.9906 0.9891
dispcorr: -0.025454648 hartree
energy: -2050.698154780299
dipole: 1.84458 -2.98575 -1.14116 38.70606 -37.52283 1.18323 0.50083 -1.36038 -0.85955
magnitude: 1.85503 au
magnitude: 4.71510 debye
