program: Orca
programVersion: 5.0.2
elementType: Cl Cl O O O N C C C C C C C C C C C C C C C C C C C C C C H H H H H H H H H H H H H H H H H H H
charge: 0
multiplicity: 1
keywords: wb97x-d3
keywords: def2-TZVPP
keywords: def2/J RIJCOSX
keywords: DEFGRID2
keywords: scfconv7
keywords: smallprint printgap noloewdin
keywords: NOSOSCF
formula: C22H19Cl2NO3
InChI: InChI=1/C22H19Cl2NO3/c1-22(2)17(12-19(23)24)20(22)21(26)28-18(13-25)14-7-6-10-16(11-14)27-15-8-4-3-5-9-15/h3-12,17-18,20H,1-2H3
47 atoms
Cl -2.115672 -5.421693 -1.422199
Cl -3.217918 -6.270997 1.103145
O  1.707427 -0.974344 1.323408
O  1.322879 -1.704977 -0.754517
O  0.025867 3.4445 -0.123414
N  4.2226 0.35512 2.999577
C  -1.636652 -1.364987 0.375891
C  -1.298809 -2.808905 0.127828
C  -0.355626 -1.953997 0.941926
C  -1.593413 -0.427209 -0.805435
C  -2.69581 -0.990918 1.383029
C  -2.008381 -3.901213 0.804183
C  0.948253 -1.5666 0.38221
C  -2.388953 -5.036848 0.233597
C  2.886626 -0.332221 0.861398
C  2.573507 0.88916 0.024334
C  3.617834 0.048043 2.070775
C  1.481028 1.680922 0.349378
C  3.373756 1.202553 -1.064341
C  1.167957 2.770686 -0.449388
C  3.061069 2.310551 -1.838732
C  1.954567 3.094215 -1.548917
C  -0.106458 4.778039 -0.429997
C  -1.293051 5.180198 -1.023311
C  0.876275 5.702134 -0.09906
C  -1.499254 6.527811 -1.285553
C  0.66159 7.043943 -0.378048
C  -0.523412 7.462647 -0.969853
H  -0.966146 -3.020772 -0.881848
H  -0.36197 -2.101336 2.016094
H  -0.894317 -0.736968 -1.578999
H  -1.32816 0.583962 -0.49015
H  -2.582819 -0.379031 -1.263066
H  -3.688306 -1.067007 0.935715
H  -2.556458 0.042586 1.703634
H  -2.679795 -1.614056 2.275984
H  -2.237673 -3.782852 1.856546
H  3.525452 -1.0217 0.299165
H  0.852976 1.453558 1.202288
H  4.22376 0.580744 -1.313883
H  3.673426 2.557025 -2.695593
H  1.709663 3.935081 -2.184402
H  -2.049469 4.446632 -1.271523
H  1.797341 5.385068 0.373818
H  -2.426786 6.843489 -1.744706
H  1.42597 7.76616 -0.123572
H  -0.685257 8.511359 -1.179983
elementType: Cl O N C H
totalener: -2050.67237521 hartree
nucrepener: 2717.41213897 hartree
electener: -4768.08451418 hartree
oneelecener: -8210.19423830 hartree
twoeener: 3442.10972412 hartree
cpcmener: -0.03723121 hartree
kineticenergy: 2044.45539462 hartree
xcener: -151.862488657416 hartree
chargesum: 0.0000000
charge: -0.057806 -0.061099 -0.284672 -0.450232 -0.337907 -0.100298 0.099154 0.028691 -0.065149 -0.268718 -0.266391 -0.205560 0.367622 0.038832 0.422815 0.040384 -0.224204 -0.289760 -0.212135 0.298278 -0.126058 -0.195996 0.262481 -0.235193 -0.185890 -0.134924 -0.153187 -0.174824 0.079088 0.103630 0.097085 0.092147 0.107232 0.101923 0.099633 0.093731 0.135867 0.148146 0.143131 0.148403 0.163775 0.160565 0.150833 0.161017 0.161449 0.162387 0.161703
qa: -0.0578 -0.0611 -0.2847 -0.4502 -0.3379 -0.1003 0.0992 0.0287 -0.0651 -0.2687 -0.2664 -0.2056 0.3676 0.0388 0.4228 0.0404 -0.2242 -0.2898 -0.2121 0.2983 -0.1261 -0.1960 0.2625 -0.2352 -0.1859 -0.1349 -0.1532 -0.1748 0.0791 0.1036 0.0971 0.0921 0.1072 0.1019 0.0996 0.0937 0.1359 0.1481 0.1431 0.1484 0.1638 0.1606 0.1508 0.1610 0.1614 0.1624 0.1617
va: 1.2676 1.2438 2.1145 2.0544 2.0430 3.1110 3.7297 3.8947 3.8182 3.9000 3.9038 3.8983 4.2228 4.2078 3.6930 3.5868 4.0861 4.0315 3.9956 3.6968 3.9011 3.9287 3.7008 3.9955 3.9158 3.8845 3.8903 3.8874 1.0482 1.0313 1.0153 1.0041 1.0022 1.0010 1.0015 1.0051 1.0158 1.0135 1.0245 1.0016 0.9889 0.9947 1.0042 0.9955 0.9887 0.9892 0.9889
dispcorr: -0.024675564 hartree
energy: -2050.697050775485
dipole: 2.29694 -3.21230 -0.91536 42.50556 -40.97791 1.52765 -3.56807 2.76452 -0.80355
magnitude: 1.95379 au
magnitude: 4.96614 debye
