program: Orca
programVersion: 5.0.2
elementType: Cl Cl O O O N C C C C C C C C C C C C C C C C C C C C C C H H H H H H H H H H H H H H H H H H H
charge: 0
multiplicity: 1
keywords: wb97x-d3
keywords: def2-TZVPP
keywords: def2/J RIJCOSX
keywords: DEFGRID2
keywords: scfconv7
keywords: smallprint printgap noloewdin
keywords: NOSOSCF
formula: C22H19Cl2NO3
InChI: InChI=1/C22H19Cl2NO3/c1-22(2)17(12-19(23)24)20(22)21(26)28-18(13-25)14-7-6-10-16(11-14)27-15-8-4-3-5-9-15/h3-12,17-18,20H,1-2H3
47 atoms
Cl -1.919724 -5.534868 -1.460131
Cl -3.119795 -6.406966 1.011675
O  1.594249 -0.89871 1.373185
O  1.327133 -1.714532 -0.690967
O  -0.086738 3.547481 -0.141776
N  3.968775 0.61822 3.094973
C  -1.680978 -1.445926 0.345613
C  -1.29014 -2.878561 0.107042
C  -0.400806 -1.995444 0.95017
C  -1.627327 -0.504972 -0.8329
C  -2.781719 -1.105572 1.319358
C  -1.990048 -3.993737 0.755244
C  0.903733 -1.56057 0.426517
C  -2.297702 -5.146253 0.174254
C  2.762515 -0.219625 0.933569
C  2.429008 0.955299 0.041939
C  3.42353 0.24023 2.155547
C  1.353415 1.772124 0.364963
C  3.192186 1.204695 -1.088481
C  1.027046 2.827291 -0.472281
C  2.862862 2.276249 -1.906501
C  1.77745 3.086618 -1.613973
C  -0.14396 4.884625 -0.460162
C  -1.286167 5.347517 -1.094088
C  0.882198 5.752617 -0.109885
C  -1.401646 6.701389 -1.380432
C  0.758404 7.100436 -0.412483
C  -0.380159 7.579971 -1.048159
H  -0.918594 -3.077795 -0.891546
H  -0.433116 -2.141855 2.02407
H  -1.388633 0.510243 -0.50938
H  -2.605786 -0.474676 -1.314984
H  -0.903555 -0.800255 -1.589487
H  -3.757761 -1.217807 0.844218
H  -2.687276 -0.066642 1.638843
H  -2.769865 -1.72394 2.215742
H  -2.27772 -3.878597 1.793586
H  3.453614 -0.899214 0.423492
H  0.75592 1.592148 1.250803
H  4.027789 0.562472 -1.334673
H  3.4460 2.472628 -2.796094
H  1.5194 3.901807 -2.277345
H  -2.077126 4.656989 -1.357577
H  1.767462 5.385944 0.394795
H  -2.292831 7.065336 -1.874579
H  1.557012 7.779155 -0.14366
H  -0.470328 8.632673 -1.280092
elementType: Cl O N C H
totalener: -2050.67240404 hartree
nucrepener: 2713.61331228 hartree
electener: -4764.28571632 hartree
oneelecener: -8202.65482515 hartree
twoeener: 3438.36910883 hartree
cpcmener: -0.03719572 hartree
kineticenergy: 2044.45865510 hartree
xcener: -151.862398707084 hartree
chargesum: 0.0000000
charge: -0.057648 -0.061405 -0.283040 -0.450044 -0.342235 -0.100600 0.101310 0.025117 -0.064097 -0.270732 -0.268056 -0.205278 0.368062 0.039720 0.428332 0.038217 -0.225677 -0.285860 -0.205059 0.278801 -0.130359 -0.180106 0.247142 -0.228479 -0.172819 -0.138312 -0.157428 -0.171350 0.078868 0.104140 0.094534 0.106725 0.096635 0.102041 0.099874 0.093958 0.135257 0.147250 0.141280 0.149122 0.164010 0.161329 0.150201 0.160748 0.161390 0.162410 0.162111
qa: -0.0576 -0.0614 -0.2830 -0.4500 -0.3422 -0.1006 0.1013 0.0251 -0.0641 -0.2707 -0.2681 -0.2053 0.3681 0.0397 0.4283 0.0382 -0.2257 -0.2859 -0.2051 0.2788 -0.1304 -0.1801 0.2471 -0.2285 -0.1728 -0.1383 -0.1574 -0.1714 0.0789 0.1041 0.0945 0.1067 0.0966 0.1020 0.0999 0.0940 0.1353 0.1472 0.1413 0.1491 0.1640 0.1613 0.1502 0.1607 0.1614 0.1624 0.1621
va: 1.2676 1.2434 2.1192 2.0556 2.0325 3.1099 3.7293 3.8949 3.8153 3.9028 3.9038 3.8990 4.2307 4.2070 3.6915 3.5762 4.0885 4.0319 3.9849 3.6974 3.9027 3.9146 3.7125 3.9968 3.9047 3.8867 3.8909 3.8839 1.0483 1.0305 1.0017 1.0019 1.0147 1.0009 1.0012 1.0051 1.0163 1.0136 1.0262 1.0014 0.9890 0.9941 1.0050 0.9955 0.9887 0.9894 0.9887
dispcorr: -0.024649694 hartree
energy: -2050.697053730250
dipole: 1.53582 -2.41471 -0.87888 42.58991 -41.16794 1.42198 -3.75547 2.88990 -0.86557
magnitude: 1.88246 au
magnitude: 4.78484 debye
