program: Orca
programVersion: 5.0.2
elementType: Cl Cl O O O N C C C C C C C C C C C C C C C C C C C C C C H H H H H H H H H H H H H H H H H H H
charge: 0
multiplicity: 1
keywords: wb97x-d3
keywords: def2-TZVPP
keywords: def2/J RIJCOSX
keywords: DEFGRID2
keywords: scfconv7
keywords: smallprint printgap noloewdin
keywords: NOSOSCF
formula: C22H19Cl2NO3
InChI: InChI=1/C22H19Cl2NO3/c1-22(2)17(12-19(23)24)20(22)21(26)28-18(13-25)14-7-6-10-16(11-14)27-15-8-4-3-5-9-15/h3-12,17-18,20H,1-2H3
47 atoms
Cl -1.040351 -6.108664 0.391558
Cl -3.600609 -5.746108 1.669157
O  0.589639 0.013541 1.305317
O  1.5462 -1.658385 0.171489
O  1.323658 3.782138 -2.180174
N  1.600145 2.306441 3.457503
C  -1.361377 -1.906726 -1.014358
C  -1.111142 -2.991875 -0.009108
C  -0.841227 -1.54797 0.366155
C  -0.458036 -1.844361 -2.220686
C  -2.775498 -1.473126 -1.313166
C  -2.210007 -3.693318 0.663761
C  0.548845 -1.116748 0.578039
C  -2.265937 -5.001462 0.876596
C  1.876535 0.583469 1.512404
C  2.394697 1.286472 0.280223
C  1.70395 1.537183 2.608774
C  1.588346 2.22638 -0.351606
C  3.655831 0.984861 -0.210319
C  2.069482 2.878253 -1.476962
C  4.118351 1.640664 -1.34309
C  3.334614 2.590418 -1.975884
C  0.437987 4.611516 -1.534471
C  0.766103 5.268369 -0.354744
C  -0.78661 4.82402 -2.149918
C  -0.154999 6.13851 0.210984
C  -1.692415 5.707231 -1.579154
C  -1.384468 6.362499 -0.395068
H  -0.222606 -3.58319 -0.198801
H  -1.56639 -1.072157 1.016202
H  0.522883 -2.281204 -2.049276
H  -0.320377 -0.812806 -2.549296
H  -0.918595 -2.393297 -3.043582
H  -3.241167 -2.160594 -2.021351
H  -2.774127 -0.480705 -1.765962
H  -3.406071 -1.426238 -0.426607
H  -3.045968 -3.10399 1.021176
H  2.594447 -0.171077 1.849893
H  0.598638 2.444499 0.032368
H  4.271208 0.24552 0.285432
H  5.099946 1.412579 -1.735879
H  3.695548 3.105209 -2.856994
H  1.726386 5.112055 0.120597
H  -1.025372 4.308356 -3.071382
H  0.098085 6.649679 1.130584
H  -2.645862 5.875075 -2.062519
H  -2.094619 7.045761 0.050937
elementType: Cl O N C H
totalener: -2050.67308315 hartree
nucrepener: 2720.32484422 hartree
electener: -4770.99792736 hartree
oneelecener: -8216.09268083 hartree
twoeener: 3445.09475347 hartree
cpcmener: -0.03647071 hartree
kineticenergy: 2044.45755770 hartree
xcener: -151.862070715710 hartree
chargesum: -0.0000000
charge: -0.057291 -0.060559 -0.288559 -0.463471 -0.338250 -0.101887 0.089167 0.035046 -0.079954 -0.267819 -0.264278 -0.204416 0.400418 0.039360 0.437575 0.017637 -0.224083 -0.215415 -0.208234 0.263398 -0.112950 -0.239901 0.293536 -0.198274 -0.255153 -0.142986 -0.122913 -0.190115 0.080368 0.101217 0.094400 0.101693 0.099829 0.101514 0.099775 0.093041 0.135775 0.144504 0.148859 0.150561 0.162934 0.151934 0.158277 0.149000 0.163294 0.161491 0.161907
qa: -0.0573 -0.0606 -0.2886 -0.4635 -0.3383 -0.1019 0.0892 0.0350 -0.0800 -0.2678 -0.2643 -0.2044 0.4004 0.0394 0.4376 0.0176 -0.2241 -0.2154 -0.2082 0.2634 -0.1130 -0.2399 0.2935 -0.1983 -0.2552 -0.1430 -0.1229 -0.1901 0.0804 0.1012 0.0944 0.1017 0.0998 0.1015 0.0998 0.0930 0.1358 0.1445 0.1489 0.1506 0.1629 0.1519 0.1583 0.1490 0.1633 0.1615 0.1619
va: 1.2682 1.2448 2.1301 2.0462 2.0701 3.1084 3.7330 3.8712 3.8567 3.9036 3.9079 3.8962 4.1775 4.2080 3.7015 3.5972 4.0871 3.9440 3.9669 3.7393 3.8952 4.0087 3.6713 3.9118 4.0111 3.8815 3.8771 3.9016 1.0477 1.0324 1.0173 0.9991 1.0005 1.0007 1.0013 1.0050 1.0158 1.0159 1.0159 1.0030 0.9879 1.0040 0.9969 1.0072 0.9887 0.9880 0.9892
dispcorr: -0.023653968 hartree
energy: -2050.696737116202
dipole: 3.79666 -4.38714 -0.59047 33.87200 -33.43149 0.44051 -17.57872 16.30825 -1.27047
magnitude: 1.46860 au
magnitude: 3.73289 debye
