program: Gaussian 09
title: 000072978
version: EM64L-G09RevD.01
frameworkgroup: C1[X(C25H24O5)]
method: RPBEPBE
basis: SDD
operation: Freq
keyword: #pfreq=noraman
keyword: PBEPBE/SDD
title: #p freq=noraman PBEPBE/SDD
converged: YES YES NO NO
title: Mulliken charges:
elementType: O O O O O C C C C C C C C C C C C C C C C C C C C C C C C C H H H H H H H H H H H H H H H H H H H H H H H H
charge: -0.251424 -0.281612 -0.468258 -0.272346 -0.203002 -0.092937 -0.258472 -0.002027 0.195940 -0.070198 0.291839 -0.021218 -0.008285 0.094743 -0.760346 0.238517 -0.751038 -0.359331 0.307845 -0.214986 -0.714922 -0.702685 -0.483768 0.343557 0.120517 -0.368249 -0.410277 -0.240640 -0.235112 -0.245390 0.237339 0.252024 0.254197 0.219152 0.249637 0.217539 0.223695 0.227335 0.234174 0.273003 0.233507 0.372190 0.244066 0.231489 0.204785 0.234826 0.218314 0.240497 0.269141 0.248140 0.250229 0.228852 0.228354 0.231081
chargesum: 0.00000
title: Mulliken charges with hydrogens summed into heavy atoms:
elementType: O O O O O C C C C C C C C C C C C C C C C C C C C C C C C C
charge: -0.251424 -0.281612 -0.096067 -0.272346 -0.203002 0.144402 -0.006449 0.252170 0.195940 -0.070198 0.291839 -0.021218 -0.008285 0.094743 -0.074017 0.238517 -0.065834 -0.086328 0.307845 0.018521 -0.034582 -0.009048 -0.214628 0.343557 0.120517 -0.120109 -0.160048 -0.011788 -0.006758 -0.014309
polarizability: 4.08271586e+02 -9.99898301e+00 3.44307507e+02 5.26718376e+00 2.04455166e+01 1.81674118e+02
1716.lowfreq: -7.8379 -7.0908 -0.0007 -0.0007 -0.0005 2.4291 18.0047 37.4071 41.5109
frequency: 17.6319 37.3817 41.4751 48.1788 64.8837 68.7480 76.9155 108.4574 114.3542 123.7860 133.8883 141.7713 185.0660 192.9404 204.0319 211.8268 218.0013 227.3759 234.9561 236.0188 242.9974 257.7545 269.9371 279.4984 289.0245 300.7907 333.3676 350.3928 367.9568 372.2204 379.8532 401.1068 404.0070 406.2675 439.1024 445.7595 474.3359 486.8475 522.8274 543.1772 545.3756 564.9889 598.7628 604.6015 621.0109 629.5091 639.1755 645.5646 657.8158 663.9275 685.7364 702.1656 714.1066 732.2213 743.4245 752.6123 771.0971 780.5172 803.0090 812.8112 825.5123 851.2246 863.3874 864.0641 898.1308 911.0898 919.6424 923.2285 937.1806 945.9067 966.9401 970.7872 972.6614 974.4746 988.2194 992.9560 993.1457 996.1423 1029.6001 1046.8930 1080.6714 1087.3302 1088.4396 1111.3136 1112.3731 1119.0279 1124.6131 1141.4303 1163.7857 1172.3686 1172.6355 1190.8232 1215.6740 1220.7311 1226.1627 1248.9057 1261.5851 1271.4573 1277.9668 1303.3197 1313.3128 1314.3554 1318.2075 1353.9660 1356.8635 1365.5102 1371.8458 1374.2328 1382.3846 1390.4230 1392.3526 1395.1861 1407.6551 1414.0425 1431.3321 1448.3996 1450.7421 1458.3046 1460.3506 1468.4924 1472.2005 1477.7753 1481.8755 1483.0965 1484.3068 1543.0052 1576.1123 1579.5214 1587.5508 1610.5305 1645.4913 1687.1464 2974.0759 2984.8653 2990.5524 2992.8973 2995.0096 2995.3084 3002.5501 3080.6787 3084.6202 3093.9212 3094.3786 3095.6626 3101.1365 3103.4134 3106.4048 3124.0356 3130.5416 3136.1810 3142.9888 3152.9959 3165.9990 3171.4452 3178.6066 3554.9037
redmass: 5.0546 3.5284 4.7285 4.3632 4.2699 4.1247 4.2357 5.4017 5.0967 4.7076 5.6942 4.6746 1.0615 1.0228 2.3606 3.2872 4.9232 3.2141 3.2028 1.0958 4.3420 3.1947 4.4503 3.1707 2.1977 3.5786 4.4353 3.4378 4.5323 5.2709 3.5540 1.1601 2.8471 2.9921 4.0900 6.2691 4.2802 4.7894 5.4760 4.3813 4.9512 6.3665 5.2803 6.4135 6.7042 6.7318 4.6822 6.4343 5.3787 5.1851 3.4069 1.7952 4.7546 5.5751 5.9169 2.5646 2.1109 3.0716 5.4635 5.3613 3.3177 1.2556 1.6546 2.5938 2.8527 4.3947 1.6220 1.4302 1.8593 1.8772 2.8269 1.3708 1.7482 1.3846 5.7018 3.3773 1.4018 1.3755 2.1760 2.0764 1.8219 2.9680 3.5181 1.9063 2.0097 2.1567 2.5119 3.8232 1.7204 1.4944 1.2334 1.1166 1.4411 2.4065 2.3580 2.8306 1.7198 1.3761 1.5109 2.2909 1.6450 1.4418 1.3444 1.7246 2.0680 1.6979 1.2845 5.3536 5.9407 1.3360 1.3191 1.2239 2.9791 4.9913 2.3724 1.7623 1.5877 1.0513 1.0435 1.1061 1.0636 1.0548 1.0998 1.0632 2.3906 8.1451 10.9396 8.1909 7.3766 6.1322 7.7129 10.9347 1.0812 1.0346 1.0685 1.0510 1.0383 1.0356 1.0856 1.0992 1.0994 1.1013 1.1001 1.0993 1.0989 1.1000 1.1008 1.0846 1.0878 1.0875 1.0926 1.0965 1.1016 1.0981 1.0913 1.0661
irintensity: 0.3793 0.3306 1.1893 0.0675 0.2268 0.3514 0.1612 2.9219 3.4738 2.6313 0.8474 0.3313 0.1140 0.0073 0.6137 0.8063 0.7396 1.5960 4.7527 0.8575 0.4251 0.5846 0.3458 4.3292 1.7033 0.6629 1.4474 2.0390 3.6293 5.7609 1.6269 148.6972 0.2436 5.2549 5.0600 11.6005 1.8704 5.2358 16.4897 12.5920 6.5671 10.3624 2.6814 2.0146 0.4164 21.0059 1.9456 8.3857 0.4189 1.0403 17.7230 47.9590 6.3862 11.6094 33.0602 37.0146 26.0127 18.3824 47.2261 14.5132 21.8214 1.6433 16.0063 27.1059 19.7009 14.8214 5.6591 0.5201 53.6061 7.3925 29.8597 5.6037 56.5551 0.6899 7.9462 37.1169 4.2750 1.4484 33.1609 109.5242 12.1969 59.8778 52.9992 38.6467 72.4475 90.0250 214.7905 36.4230 16.8433 26.9099 13.9766 2.8189 21.9328 19.0836 43.4915 14.3809 16.0847 60.0134 16.2718 16.4541 5.2052 36.9135 44.7420 20.6831 141.0326 7.7701 33.5990 21.3835 30.8398 41.4007 6.4578 37.7082 17.3419 13.4632 15.4587 10.6223 6.6455 1.2284 23.0368 7.1408 5.0749 5.1689 11.8394 16.9070 15.7990 36.4567 555.6261 58.5255 34.5296 2.1845 59.6472 698.9910 6.1564 13.2992 8.5633 30.8659 38.2469 15.1718 31.2516 30.1820 8.2173 17.2233 23.9234 28.4889 22.7767 20.6877 19.8156 1.6824 1.1706 3.2021 19.9189 32.3331 19.9756 11.6098 0.3620 11.8646
temp: 298.150 k
press: 1.00000 atm
elementType: 8 8 8 8 8 6 6 6 6 6 6 6 6 6 6 6 6 6 6 6 6 6 6 6 6 6 6 6 6 6 1 1 1 1 1 1 1 1 1 1 1 1 1 1 1 1 1 1 1 1 1 1 1 1
symmnumber: 1
zpe: 1120511.5 jmol-1
zpe.correction: 0.426780 hartree
zpe.thermalcorrener: 0.454024 hartree
zpe.thermalcorrenthalpy: 0.454968 hartree
zpe.thermalcorrgfe: 0.369920 hartree
zpe.sumelectzpe: -1341.034417 hartree
zpe.sumelectthermal: -1341.007174 hartree
zpe.sumelectthermalent: -1341.006230 hartree
zpe.sumelectthermalfe: -1341.091278 hartree
dipole: 1.7612 -6.2664 0.6087
dipole: 6.5376
quadrupole: -150.6270 -190.7125 -171.6798
quadrupole: 2.4681 -1.3106 -0.2205
quadrupole: 20.3794 -19.7061 -0.6733 2.4681 -1.3106 -0.2205
hfenergy: -1341.4611978 hartree
pointgroup: C01 [X(C25H24O5)]
dipole: 0.6406281 -2.4899364 0.0735309 debye
polarizability: 407.8618554|-11.5412219|341.4128345|3.7935907|30.8550186|184.9785211 unknown
InChI: InChI=1S/C25H24O5/c1-13-14(2)28-22-16-10-11-25(3,4)30-23(16)19-17(15-8-6-5-7-9-15)12-18(26)29-24(19)20(22)21(13)27/h5-14,21,27H,1-4H3
charge 0 multiplicity 1
54 atoms
O  -3.1479 -1.696993 -0.33486
O  1.665961 -1.505539 -0.053874
O  -3.752159 2.005483 -0.893676
O  -1.020936 2.553621 0.397582
O  -0.132548 4.632973 0.859166
C  -4.560623 0.172685 0.501593
C  -3.41169 1.184015 0.291748
C  -4.442228 -0.945439 -0.556335
C  -2.085063 0.467212 0.1093
C  -2.011427 -0.921981 -0.138428
C  -0.761548 -1.607231 -0.174746
C  -0.868423 1.176132 0.192085
C  0.435924 -0.85924 -0.025514
C  0.42816 0.574868 0.083634
C  -5.935735 0.870605 0.482305
C  1.722385 -2.987917 0.30305
C  -5.522702 -2.021443 -0.513139
C  -0.663858 -3.040478 -0.456101
C  1.594697 1.450066 0.163753
C  0.516043 -3.699618 -0.287987
C  3.04972 -3.457569 -0.310026
C  1.732081 -3.077437 1.846042
C  1.415396 2.801343 0.446878
C  2.999184 1.007692 -0.106081
C  0.127186 3.439394 0.610134
C  3.347449 0.406706 -1.344269
C  4.026398 1.294532 0.830158
C  4.691524 0.097889 -1.635903
C  5.37095 0.966283 0.546288
C  5.709131 0.370378 -0.690002
H  -4.40753 -0.298209 1.495639
H  -3.343242 1.848506 1.176306
H  -4.3699 -0.48511 -1.562733
H  -5.946918 1.707365 1.203946
H  -6.146325 1.29474 -0.513493
H  -6.743954 0.171893 0.760316
H  -5.629761 -2.434277 0.50583
H  -6.49343 -1.604134 -0.830157
H  -5.263078 -2.846803 -1.198103
H  -1.559518 -3.548035 -0.824582
H  0.626842 -4.761326 -0.534944
H  -3.095751 2.747998 -0.933317
H  3.88226 -2.837362 0.062883
H  3.020322 -3.380067 -1.409811
H  3.239232 -4.510574 -0.033814
H  2.590632 -2.51659 2.256176
H  1.813681 -4.133383 2.162072
H  0.79818 -2.666873 2.267558
H  2.277099 3.471589 0.494763
H  2.564051 0.187591 -2.077049
H  3.76573 1.755589 1.789844
H  4.947052 -0.353322 -2.60113
H  6.150674 1.18074 1.285558
H  6.752703 0.125063 -0.917037
