program: Orca
programVersion: 5.0.2
elementType: Cl Cl O O O N C C C C C C C C C C C C C C C C C C C C C C H H H H H H H H H H H H H H H H H H H
charge: 0
multiplicity: 1
keywords: wb97x-d3
keywords: def2-TZVPP
keywords: def2/J RIJCOSX
keywords: DEFGRID2
keywords: scfconv7
keywords: smallprint printgap noloewdin
keywords: NOSOSCF
formula: C22H19Cl2NO3
InChI: InChI=1/C22H19Cl2NO3/c1-22(2)17(12-19(23)24)20(22)21(26)28-18(13-25)14-7-6-10-16(11-14)27-15-8-4-3-5-9-15/h3-12,17-18,20H,1-2H3
47 atoms
Cl -2.923992 -4.101301 3.135862
Cl -5.31143 -2.628841 2.460159
O  0.736279 -0.797349 -1.070707
O  1.063754 -2.43908 0.419749
O  1.601225 4.303119 0.440928
N  2.888275 0.357706 -3.317195
C  -1.560923 -3.484405 -1.016731
C  -1.82564 -3.041203 0.393625
C  -1.097908 -2.115765 -0.554357
C  -0.566732 -4.599743 -1.231158
C  -2.68605 -3.498195 -2.022946
C  -3.172391 -2.686472 0.859505
C  0.333299 -1.834216 -0.316195
C  -3.720259 -3.088529 1.999892
C  2.097682 -0.393276 -0.942943
C  2.240933 0.715493 0.069038
C  2.524512 0.026362 -2.279362
C  1.857377 2.009306 -0.262328
C  2.712968 0.422402 1.340053
C  1.972787 3.019719 0.681814
C  2.808972 1.438591 2.279809
C  2.449386 2.734248 1.956709
C  1.664792 4.811563 -0.82871
C  0.561865 5.506931 -1.298006
C  2.808695 4.688495 -1.606918
C  0.607025 6.087179 -2.557202
C  2.834843 5.260495 -2.868589
C  1.737811 5.961122 -3.348989
H  -1.186893 -3.505215 1.136328
H  -1.655824 -1.280549 -0.96272
H  0.209242 -4.630989 -0.470247
H  -0.082902 -4.505075 -2.20499
H  -1.085586 -5.559241 -1.213301
H  -2.284721 -3.470021 -3.036819
H  -3.366476 -2.65361 -1.921547
H  -3.275396 -4.410878 -1.922372
H  -3.781656 -2.047871 0.232108
H  2.719338 -1.243244 -0.646945
H  1.483988 2.229828 -1.255267
H  2.994747 -0.589807 1.597304
H  3.178132 1.220371 3.272724
H  2.534919 3.532124 2.682522
H  -0.319004 5.594815 -0.676003
H  3.670883 4.149789 -1.235224
H  -0.252618 6.633243 -2.922267
H  3.722859 5.158273 -3.477638
H  1.76631 6.406965 -4.333801
totalener: -2050.66201329 hartree
nucrepener: 2685.74229137 hartree
electener: -4736.40430466 hartree
oneelecener: -8146.91451955 hartree
twoeener: 3410.51021489 hartree
kineticenergy: 2044.53344343 hartree
xcener: -151.870933541033 hartree
chargesum: 0.0000000
charge: -0.039350 -0.044529 -0.259835 -0.381706 -0.296759 -0.003626 0.064605 0.045337 -0.096849 -0.250982 -0.240367 -0.203731 0.362636 0.051506 0.323195 0.007675 -0.262385 -0.184736 -0.138857 0.216109 -0.090804 -0.199396 0.240281 -0.207254 -0.165470 -0.092507 -0.100138 -0.140988 0.086485 0.080441 0.100225 0.091593 0.091698 0.096578 0.072119 0.099605 0.097285 0.121618 0.129051 0.123618 0.129438 0.129458 0.125231 0.132844 0.126395 0.128586 0.126655
qa: -0.0394 -0.0445 -0.2598 -0.3817 -0.2968 -0.0036 0.0646 0.0453 -0.0968 -0.2510 -0.2404 -0.2037 0.3626 0.0515 0.3232 0.0077 -0.2624 -0.1847 -0.1389 0.2161 -0.0908 -0.1994 0.2403 -0.2073 -0.1655 -0.0925 -0.1001 -0.1410 0.0865 0.0804 0.1002 0.0916 0.0917 0.0966 0.0721 0.0996 0.0973 0.1216 0.1291 0.1236 0.1294 0.1295 0.1252 0.1328 0.1264 0.1286 0.1267
va: 1.2879 1.2608 2.1336 2.1213 2.1165 3.1149 3.7705 3.8153 3.8652 3.9161 3.9087 3.9221 4.2518 4.2463 3.8168 3.6905 4.0316 3.9883 3.9727 3.8692 3.9543 4.0358 3.8040 4.0453 3.9609 3.9316 3.9494 3.9641 1.0514 1.0356 1.0190 1.0013 1.0021 1.0041 1.0104 1.0028 1.0296 1.0249 1.0154 1.0186 0.9995 1.0116 1.0133 1.0031 0.9988 0.9999 1.0002
dispcorr: -0.022970810 hartree
energy: -2050.684984095670
dipole: 16.41783 -16.78836 -0.37053 10.01671 -9.98551 0.03121 -23.53642 23.52849 -0.00793
magnitude: 0.37193 au
magnitude: 0.94537 debye
