program: Orca
programVersion: 5.0.2
elementType: Cl Cl O O O N C C C C C C C C C C C C C C C C C C C C C C H H H H H H H H H H H H H H H H H H H
charge: 0
multiplicity: 1
keywords: wb97x-d3
keywords: def2-TZVPP
keywords: def2/J RIJCOSX
keywords: DEFGRID2
keywords: scfconv7
keywords: smallprint printgap noloewdin
keywords: NOSOSCF
formula: C22H19Cl2NO3
InChI: InChI=1/C22H19Cl2NO3/c1-22(2)17(12-19(23)24)20(22)21(26)28-18(13-25)14-7-6-10-16(11-14)27-15-8-4-3-5-9-15/h3-12,17-18,20H,1-2H3
47 atoms
Cl -1.169113 0.238726 1.231566
Cl -4.040365 0.527892 1.063706
O  1.38666 -1.617376 -1.103055
O  1.367324 -2.940165 0.702862
O  0.997464 3.208189 0.770388
N  3.78996 -0.276361 -2.94752
C  -1.469218 -3.819861 -0.339503
C  -1.604953 -2.703595 0.637019
C  -0.649321 -2.558686 -0.533027
C  -0.818918 -5.103727 0.113908
C  -2.564746 -4.029368 -1.358335
C  -2.787221 -1.817628 0.703809
C  0.785951 -2.434955 -0.217547
C  -2.684563 -0.521259 0.968515
C  2.683996 -1.153637 -0.749333
C  2.592178 -0.057208 0.284966
C  3.287625 -0.667023 -1.991585
C  1.857709 1.087467 -0.011538
C  3.180651 -0.220746 1.526213
C  1.719212 2.075113 0.952016
C  3.039033 0.778522 2.480698
C  2.31363 1.9202 2.202776
C  0.554955 3.536647 -0.485805
C  -0.794023 3.411187 -0.775272
C  1.445309 4.0283 -1.429314
C  -1.256238 3.796123 -2.025717
C  0.972627 4.4016 -2.677402
C  -0.377202 4.287565 -2.978898
H  -1.103237 -2.862067 1.588382
H  -0.982691 -1.913304 -1.337222
H  -1.577351 -5.772493 0.524293
H  -0.060769 -4.948893 0.876991
H  -0.349473 -5.615456 -0.727683
H  -3.365991 -4.641542 -0.939903
H  -2.176514 -4.549805 -2.23461
H  -3.004874 -3.092623 -1.701782
H  -3.777147 -2.231568 0.553538
H  3.303258 -1.972707 -0.37064
H  1.393183 1.197399 -0.983712
H  3.730084 -1.123531 1.756499
H  3.492593 0.66041 3.455416
H  2.194761 2.69791 2.945619
H  -1.472192 3.021566 -0.027711
H  2.496211 4.120213 -1.186494
H  -2.309811 3.705829 -2.254412
H  1.663791 4.784662 -3.416061
H  -0.74184 4.583946 -3.953085
totalener: -2050.65897614 hartree
nucrepener: 2946.01916935 hartree
electener: -4996.67814549 hartree
oneelecener: -8667.73620728 hartree
twoeener: 3671.05806179 hartree
kineticenergy: 2044.54819388 hartree
xcener: -151.874485169779 hartree
chargesum: 0.0000000
charge: -0.026156 -0.044081 -0.262978 -0.373138 -0.282698 -0.002539 0.128291 -0.034382 -0.125761 -0.249613 -0.271633 -0.240479 0.332740 0.098759 0.346815 0.057794 -0.267002 -0.256139 -0.142168 0.202200 -0.079861 -0.192499 0.210326 -0.151586 -0.143315 -0.129754 -0.118123 -0.116154 0.116118 0.101690 0.085340 0.103080 0.088546 0.096191 0.097190 0.084789 0.121531 0.118429 0.126713 0.109789 0.126623 0.127433 0.116920 0.130530 0.126470 0.129117 0.126635
qa: -0.0262 -0.0441 -0.2630 -0.3731 -0.2827 -0.0025 0.1283 -0.0344 -0.1258 -0.2496 -0.2716 -0.2405 0.3327 0.0988 0.3468 0.0578 -0.2670 -0.2561 -0.1422 0.2022 -0.0799 -0.1925 0.2103 -0.1516 -0.1433 -0.1298 -0.1181 -0.1162 0.1161 0.1017 0.0853 0.1031 0.0885 0.0962 0.0972 0.0848 0.1215 0.1184 0.1267 0.1098 0.1266 0.1274 0.1169 0.1305 0.1265 0.1291 0.1266
va: 1.3284 1.2632 2.1261 2.1261 2.1084 3.1218 3.7274 3.8614 3.8562 3.8966 3.9131 3.9257 4.2282 4.1866 3.8241 3.6315 4.0322 3.9240 4.0148 3.7937 3.9591 4.0415 3.8287 4.0022 3.9854 3.9737 3.9487 3.9439 1.0250 1.0268 1.0022 1.0212 1.0025 1.0003 1.0067 1.0010 1.0145 1.0207 1.0301 1.0169 0.9993 1.0130 1.0322 1.0057 1.0007 0.9999 0.9998
dispcorr: -0.028143611 hartree
energy: -2050.687119748316
dipole: 3.16240 -4.32763 -1.16523 -15.54562 14.88132 -0.66430 -8.97045 9.40139 0.43094
magnitude: 1.40882 au
magnitude: 3.58093 debye
