program: Orca
programVersion: 5.0.2
elementType: Cl Cl O O O N C C C C C C C C C C C C C C C C C C C C C C H H H H H H H H H H H H H H H H H H H
charge: 0
multiplicity: 1
keywords: wb97x-d3
keywords: def2-TZVPP
keywords: def2/J RIJCOSX
keywords: DEFGRID2
keywords: scfconv7
keywords: smallprint printgap noloewdin
keywords: NOSOSCF
formula: C22H19Cl2NO3
InChI: InChI=1/C22H19Cl2NO3/c1-22(2)17(12-19(23)24)20(22)21(26)28-18(13-25)14-7-6-10-16(11-14)27-15-8-4-3-5-9-15/h3-12,17-18,20H,1-2H3
47 atoms
Cl -3.818411 -0.082096 1.537178
Cl -4.69701 0.455678 -1.155921
O  1.903785 -1.72228 -0.404645
O  0.891776 -1.938104 1.587413
O  1.930202 3.388736 0.249906
N  4.934282 -3.068688 -0.544016
C  -1.302678 -3.385485 -0.140012
C  -1.71312 -1.977582 0.17056
C  -0.347815 -2.247486 -0.435819
C  -1.051884 -4.319063 1.018868
C  -1.880313 -4.089157 -1.345299
C  -2.700485 -1.237612 -0.623318
C  0.845072 -1.970598 0.388549
C  -3.615128 -0.409857 -0.133376
C  3.129975 -1.337267 0.210083
C  3.451018 0.087672 -0.177723
C  4.141589 -2.303079 -0.220662
C  2.553264 1.068565 0.229691
C  4.572805 0.430418 -0.916079
C  2.768691 2.389675 -0.130853
C  4.793543 1.761782 -1.242952
C  3.894891 2.742108 -0.865412
C  0.577173 3.182542 0.237038
C  -0.156511 3.699972 1.293354
C  -0.058295 2.534994 -0.815613
C  -1.537395 3.572256 1.291605
C  -1.438418 2.405774 -0.798251
C  -2.183912 2.922908 0.251226
H  -1.684601 -1.724308 1.224031
H  -0.224787 -2.010567 -1.486503
H  -0.314897 -5.077482 0.749016
H  -1.977754 -4.83575 1.275865
H  -0.697774 -3.808686 1.910608
H  -1.999038 -3.437674 -2.210398
H  -2.859809 -4.507348 -1.108943
H  -1.230927 -4.911486 -1.648294
H  -2.682116 -1.351857 -1.700132
H  3.041768 -1.413638 1.298619
H  1.689356 0.810675 0.831235
H  5.276866 -0.325262 -1.238004
H  5.670065 2.033126 -1.815565
H  4.055388 3.778379 -1.131583
H  0.355041 4.203089 2.103228
H  0.515367 2.142212 -1.645431
H  -2.109136 3.979424 2.11491
H  -1.937197 1.905519 -1.61774
H  -3.260187 2.821484 0.25438
totalener: -2050.66154230 hartree
nucrepener: 2876.56604213 hartree
electener: -4927.22758442 hartree
oneelecener: -8528.14283827 hartree
twoeener: 3600.91525384 hartree
kineticenergy: 2044.53046753 hartree
xcener: -151.873838612610 hartree
chargesum: -0.0000000
charge: -0.036077 -0.050127 -0.261546 -0.375024 -0.298687 0.000047 0.063587 0.064495 -0.096303 -0.245926 -0.244619 -0.209115 0.348937 0.044394 0.374532 -0.043125 -0.285012 -0.137607 -0.166731 0.178868 -0.078166 -0.197872 0.241161 -0.209550 -0.170190 -0.092361 -0.093194 -0.143616 0.089856 0.081109 0.090461 0.089876 0.103063 0.072471 0.099923 0.097462 0.097587 0.136435 0.147184 0.128217 0.130897 0.129489 0.125260 0.129416 0.126212 0.118706 0.125201
qa: -0.0361 -0.0501 -0.2615 -0.3750 -0.2987 0.0000 0.0636 0.0645 -0.0963 -0.2459 -0.2446 -0.2091 0.3489 0.0444 0.3745 -0.0431 -0.2850 -0.1376 -0.1667 0.1789 -0.0782 -0.1979 0.2412 -0.2095 -0.1702 -0.0924 -0.0932 -0.1436 0.0899 0.0811 0.0905 0.0899 0.1031 0.0725 0.0999 0.0975 0.0976 0.1364 0.1472 0.1282 0.1309 0.1295 0.1253 0.1294 0.1262 0.1187 0.1252
va: 1.2877 1.2528 2.1156 2.1244 2.1109 3.1209 3.7857 3.7803 3.8665 3.9172 3.9107 3.9242 4.2410 4.2361 3.7592 3.8712 4.0623 3.8858 3.9798 3.8843 3.9569 4.0431 3.7987 4.0550 3.9674 3.9911 3.8810 3.9092 1.0493 1.0372 1.0022 1.0012 1.0198 1.0097 1.0024 1.0042 1.0301 1.0269 1.0116 1.0228 0.9996 1.0110 1.0133 1.0061 0.9997 1.0094 1.0183
dispcorr: -0.027306903 hartree
energy: -2050.688849199197
dipole: 11.33978 -12.24845 -0.90867 -11.39549 11.63177 0.23628 -3.79989 3.34051 -0.45939
magnitude: 1.04525 au
magnitude: 2.65681 debye
