program: Orca
programVersion: 5.0.2
elementType: Cl Cl O O O N C C C C C C C C C C C C C C C C C C C C C C H H H H H H H H H H H H H H H H H H H
charge: 0
multiplicity: 1
keywords: wb97x-d3
keywords: def2-TZVPP
keywords: def2/J RIJCOSX
keywords: DEFGRID2
keywords: scfconv7
keywords: smallprint printgap noloewdin
keywords: NOSOSCF
formula: C22H19Cl2NO3
InChI: InChI=1/C22H19Cl2NO3/c1-22(2)17(12-19(23)24)20(22)21(26)28-18(13-25)14-7-6-10-16(11-14)27-15-8-4-3-5-9-15/h3-12,17-18,20H,1-2H3
47 atoms
Cl -1.796634 -1.027696 -2.314532
Cl -3.568727 -2.730933 -3.837073
O  1.185844 -1.857332 0.312592
O  -0.491651 -1.182846 1.62922
O  0.510334 3.97869 0.620168
N  4.434059 -1.241781 0.173566
C  -1.718098 -3.993973 0.886258
C  -2.299966 -2.924822 0.027108
C  -0.795903 -3.041245 0.145835
C  -1.890647 -3.896726 2.381818
C  -1.708484 -5.414208 0.372374
C  -2.946601 -3.204122 -1.273589
C  -0.068261 -1.938061 0.798932
C  -2.789021 -2.42804 -2.338278
C  1.930262 -0.715348 0.704505
C  1.483172 0.520395 -0.041223
C  3.328595 -1.028478 0.400818
C  1.211239 1.681178 0.660717
C  1.338237 0.480317 -1.423685
C  0.81482 2.82207 -0.028265
C  0.915139 1.614505 -2.094596
C  0.660159 2.790788 -1.404696
C  1.349659 4.453776 1.58773
C  0.76689 5.137747 2.645024
C  2.730459 4.315711 1.51242
C  1.572444 5.687647 3.629543
C  3.522172 4.861837 2.510983
C  2.951394 5.54835 3.572141
H  -2.713859 -2.075782 0.565923
H  -0.27954 -3.472695 -0.703674
H  -1.938857 -2.870548 2.736691
H  -1.069863 -4.395023 2.900151
H  -2.81594 -4.395416 2.675557
H  -2.654238 -5.91103 0.597797
H  -0.91364 -5.987395 0.851089
H  -1.55147 -5.471583 -0.705113
H  -3.602091 -4.062259 -1.3648
H  1.850099 -0.547384 1.783637
H  1.297617 1.700453 1.740307
H  1.551675 -0.427048 -1.97332
H  0.796528 1.590846 -3.169479
H  0.339574 3.682878 -1.92605
H  -0.309621 5.238592 2.686554
H  3.189964 3.793957 0.682868
H  1.115243 6.222613 4.451422
H  4.596845 4.751915 2.45018
H  3.576135 5.973923 4.345502
totalener: -2050.65909160 hartree
nucrepener: 2793.28670415 hartree
electener: -4843.94579575 hartree
oneelecener: -8362.03242205 hartree
twoeener: 3518.08662629 hartree
kineticenergy: 2044.54682142 hartree
xcener: -151.873019376213 hartree
chargesum: 0.0000000
charge: -0.033663 -0.039384 -0.260943 -0.368365 -0.298593 -0.001154 0.116871 -0.027075 -0.128770 -0.249360 -0.270021 -0.251302 0.334770 0.102519 0.315253 0.093120 -0.253084 -0.133717 -0.268549 0.194050 -0.090948 -0.171778 0.239661 -0.212356 -0.157737 -0.087761 -0.120596 -0.147815 0.115006 0.102367 0.102831 0.089193 0.086453 0.095474 0.097457 0.086771 0.119445 0.118107 0.117489 0.135921 0.136477 0.131192 0.126413 0.134229 0.125501 0.129846 0.126558
qa: -0.0337 -0.0394 -0.2609 -0.3684 -0.2986 -0.0012 0.1169 -0.0271 -0.1288 -0.2494 -0.2700 -0.2513 0.3348 0.1025 0.3153 0.0931 -0.2531 -0.1337 -0.2685 0.1940 -0.0909 -0.1718 0.2397 -0.2124 -0.1577 -0.0878 -0.1206 -0.1478 0.1150 0.1024 0.1028 0.0892 0.0865 0.0955 0.0975 0.0868 0.1194 0.1181 0.1175 0.1359 0.1365 0.1312 0.1264 0.1342 0.1255 0.1298 0.1266
va: 1.3139 1.2671 2.1201 2.1350 2.1093 3.1208 3.7377 3.8456 3.8615 3.8996 3.9132 3.9263 4.2131 4.2013 3.8409 3.5544 4.0185 3.9852 3.9956 3.8878 3.8922 4.0372 3.8058 4.0346 3.9237 3.9362 3.9579 3.9636 1.0243 1.0258 1.0201 1.0021 1.0025 1.0005 1.0065 1.0011 1.0159 1.0224 1.0150 1.0200 0.9973 1.0092 1.0139 1.0044 0.9986 0.9996 1.0002
dispcorr: -0.025491946 hartree
energy: -2050.684583544438
dipole: 7.09438 -8.22175 -1.12737 -0.96845 0.56350 -0.40495 25.65879 -25.27893 0.37986
magnitude: 1.25668 au
magnitude: 3.19422 debye
