program: Orca
programVersion: 5.0.2
elementType: Cl Cl O O O N C C C C C C C C C C C C C C C C C C C C C C H H H H H H H H H H H H H H H H H H H
charge: 0
multiplicity: 1
keywords: wb97x-d3
keywords: def2-TZVPP
keywords: def2/J RIJCOSX
keywords: DEFGRID2
keywords: scfconv7
keywords: smallprint printgap noloewdin
keywords: NOSOSCF
formula: C22H19Cl2NO3
InChI: InChI=1/C22H19Cl2NO3/c1-22(2)17(12-19(23)24)20(22)21(26)28-18(13-25)14-7-6-10-16(11-14)27-15-8-4-3-5-9-15/h3-12,17-18,20H,1-2H3
47 atoms
Cl -2.396016 -0.951684 -1.936083
Cl -4.550761 -2.620016 -2.901194
O  1.23076 -1.772924 -0.354814
O  0.05216 -1.273563 1.479718
O  0.741673 4.008939 0.671388
N  4.286082 -1.108849 -1.417885
C  -1.318591 -4.051206 0.929319
C  -2.155696 -2.949372 0.376123
C  -0.688733 -3.016642 0.011967
C  -1.01617 -4.062469 2.407242
C  -1.448299 -5.432402 0.331994
C  -3.17439 -3.175733 -0.672213
C  0.197048 -1.939959 0.492914
C  -3.35169 -2.358079 -1.701552
C  2.073575 -0.659237 -0.102256
C  1.448197 0.636947 -0.563593
C  3.308676 -0.926137 -0.843137
C  1.405309 1.719335 0.299735
C  0.922847 0.732601 -1.846604
C  0.851695 2.919596 -0.133423
C  0.354212 1.926358 -2.257568
C  0.322581 3.02366 -1.411463
C  1.717417 4.300362 1.582668
C  3.068102 4.242538 1.261765
C  1.307623 4.724986 2.837704
C  4.006702 4.61104 2.213242
C  2.25719 5.099973 3.775805
C  3.60873 5.040773 3.470988
H  -2.396678 -2.155473 1.079117
H  -0.459086 -3.370869 -0.986187
H  -0.97745 -3.066785 2.840669
H  -0.061438 -4.552336 2.603776
H  -1.788396 -4.625678 2.933414
H  -1.640986 -5.409162 -0.74088
H  -2.264317 -5.981776 0.805548
H  -0.532153 -6.002774 0.489267
H  -3.830191 -4.034684 -0.590877
H  2.324053 -0.592537 0.96163
H  1.789849 1.626091 1.307961
H  0.959136 -0.112967 -2.52103
H  -0.056991 2.011635 -3.254339
H  -0.112282 3.960835 -1.732617
H  3.387156 3.922094 0.278026
H  0.251213 4.76602 3.068282
H  5.058435 4.568372 1.962641
H  1.935234 5.434469 4.753197
H  4.346965 5.330339 4.206404
totalener: -2050.65955751 hartree
nucrepener: 2786.67308236 hartree
electener: -4837.33263988 hartree
oneelecener: -8348.84724613 hartree
twoeener: 3511.51460625 hartree
kineticenergy: 2044.53626586 hartree
xcener: -151.870919415035 hartree
chargesum: 0.0000000
charge: -0.035468 -0.039341 -0.259655 -0.370618 -0.297028 -0.001388 0.117371 -0.024992 -0.134176 -0.250493 -0.268920 -0.251140 0.337400 0.102761 0.314291 0.077882 -0.253569 -0.132709 -0.263901 0.211784 -0.078137 -0.188334 0.241308 -0.167864 -0.209156 -0.113490 -0.088910 -0.144230 0.113566 0.105137 0.102796 0.089489 0.086149 0.087570 0.094501 0.097138 0.119707 0.117325 0.116788 0.132118 0.133379 0.129984 0.135852 0.126783 0.130132 0.125900 0.126410
qa: -0.0355 -0.0393 -0.2597 -0.3706 -0.2970 -0.0014 0.1174 -0.0250 -0.1342 -0.2505 -0.2689 -0.2511 0.3374 0.1028 0.3143 0.0779 -0.2536 -0.1327 -0.2639 0.2118 -0.0781 -0.1883 0.2413 -0.1679 -0.2092 -0.1135 -0.0889 -0.1442 0.1136 0.1051 0.1028 0.0895 0.0861 0.0876 0.0945 0.0971 0.1197 0.1173 0.1168 0.1321 0.1334 0.1300 0.1359 0.1268 0.1301 0.1259 0.1264
va: 1.3108 1.2671 2.1227 2.1327 2.1133 3.1210 3.7297 3.8454 3.8679 3.9010 3.9143 3.9222 4.2113 4.2001 3.8451 3.5886 4.0190 3.9652 4.0019 3.8772 3.9110 4.0394 3.8064 3.9486 4.0427 3.9462 3.9312 3.9628 1.0240 1.0247 1.0205 1.0020 1.0024 1.0006 1.0009 1.0064 1.0160 1.0229 1.0163 1.0207 0.9975 1.0107 1.0032 1.0137 0.9993 0.9989 1.0003
dispcorr: -0.025207979 hartree
energy: -2050.684765492304
dipole: 14.33611 -15.27488 -0.93876 -2.60179 2.20666 -0.39513 23.60298 -22.79585 0.80712
magnitude: 1.29956 au
magnitude: 3.30322 debye
