program: Orca
programVersion: 5.0.2
elementType: Cl Cl O O O N C C C C C C C C C C C C C C C C C C C C C C H H H H H H H H H H H H H H H H H H H
charge: 0
multiplicity: 1
keywords: wb97x-d3
keywords: def2-TZVPP
keywords: def2/J RIJCOSX
keywords: DEFGRID2
keywords: scfconv7
keywords: smallprint printgap noloewdin
keywords: NOSOSCF
formula: C22H19Cl2NO3
InChI: InChI=1/C22H19Cl2NO3/c1-22(2)17(12-19(23)24)20(22)21(26)28-18(13-25)14-7-6-10-16(11-14)27-15-8-4-3-5-9-15/h3-12,17-18,20H,1-2H3
47 atoms
Cl -1.715191 0.370383 1.555498
Cl -4.490126 0.578067 0.780536
O  1.459985 -1.563835 -0.172251
O  0.9326 -2.91384 1.537455
O  1.58738 3.426171 -0.078955
N  4.434918 -3.096404 -0.481473
C  -1.555021 -3.612901 -0.258292
C  -1.926864 -2.585913 0.754833
C  -0.710135 -2.358328 -0.116561
C  -1.040927 -4.949542 0.217361
C  -2.357871 -3.699681 -1.53438
C  -3.104967 -1.705123 0.598544
C  0.616338 -2.349265 0.527902
C  -3.100781 -0.420532 0.929138
C  2.737916 -1.304573 0.382292
C  3.134136 0.10946 0.015124
C  3.686768 -2.309961 -0.106696
C  2.163296 1.098906 0.114064
C  4.430225 0.438353 -0.351305
C  2.490297 2.414651 -0.176519
C  4.748651 1.762974 -0.61714
C  3.787216 2.753815 -0.540717
C  0.274206 3.208238 -0.393246
C  -0.682789 3.773515 0.435686
C  -0.1030 2.500166 -1.527979
C  -2.02633 3.632407 0.123952
C  -1.450013 2.358514 -1.820751
C  -2.416418 2.92281 -1.001094
H  -1.688429 -2.844919 1.78358
H  -0.822693 -1.634574 -0.915668
H  -1.879114 -5.636308 0.346287
H  -0.511435 -4.890046 1.164524
H  -0.364968 -5.388849 -0.517839
H  -2.697258 -2.724691 -1.885462
H  -3.239134 -4.32794 -1.390576
H  -1.761243 -4.147523 -2.330066
H  -4.030722 -2.126204 0.224484
H  2.701019 -1.403866 1.472843
H  1.150426 0.849464 0.402349
H  5.192347 -0.324358 -0.440316
H  5.758597 2.020987 -0.905521
H  4.028652 3.784808 -0.762138
H  -0.37044 4.322635 1.314238
H  0.644669 2.066955 -2.179891
H  -2.771633 4.072034 0.773111
H  -1.743525 1.809179 -2.705668
H  -3.464994 2.807151 -1.236307
totalener: -2050.65914895 hartree
nucrepener: 2934.75961343 hartree
electener: -4985.41876238 hartree
oneelecener: -8644.82046713 hartree
twoeener: 3659.40170475 hartree
kineticenergy: 2044.54381580 hartree
xcener: -151.876711319960 hartree
chargesum: -0.0000000
charge: -0.030484 -0.046690 -0.269013 -0.370085 -0.296558 -0.001239 0.111054 -0.019580 -0.127211 -0.248760 -0.269052 -0.243217 0.355185 0.110035 0.359421 -0.014411 -0.272369 -0.143673 -0.170488 0.241337 -0.077337 -0.209331 0.254995 -0.210913 -0.162774 -0.076689 -0.103992 -0.183728 0.112891 0.098709 0.086011 0.103911 0.093331 0.084217 0.094870 0.098695 0.120690 0.128756 0.069083 0.127487 0.128873 0.127926 0.125712 0.132734 0.124141 0.127881 0.129653
qa: -0.0305 -0.0467 -0.2690 -0.3701 -0.2966 -0.0012 0.1111 -0.0196 -0.1272 -0.2488 -0.2691 -0.2432 0.3552 0.1100 0.3594 -0.0144 -0.2724 -0.1437 -0.1705 0.2413 -0.0773 -0.2093 0.2550 -0.2109 -0.1628 -0.0767 -0.1040 -0.1837 0.1129 0.0987 0.0860 0.1039 0.0933 0.0842 0.0949 0.0987 0.1207 0.1288 0.0691 0.1275 0.1289 0.1279 0.1257 0.1327 0.1241 0.1279 0.1297
va: 1.3106 1.2614 2.1172 2.1320 2.1159 3.1179 3.7618 3.8427 3.8571 3.9038 3.9104 3.9285 4.1786 4.1613 3.8026 3.8274 4.0364 3.9258 3.9848 3.8299 3.9648 4.0405 3.7707 4.0138 3.9388 3.8900 3.9084 3.9115 1.0252 1.0234 1.0016 1.0193 1.0023 1.0018 1.0009 1.0065 1.0153 1.0170 1.0536 1.0222 1.0000 1.0127 1.0133 1.0029 1.0025 0.9992 1.0073
dispcorr: -0.028721706 hartree
energy: -2050.687870654114
dipole: 3.23017 -4.64211 -1.41194 -13.43514 13.92217 0.48703 -11.76139 11.37906 -0.38233
magnitude: 1.54174 au
magnitude: 3.91879 debye
